{"text_format":"1","workbook":"xlsx","n_sheets":9,"sheets":["申請について","1入力ｼｰﾄ","営業種目ｺｰﾄﾞ一覧表","主要取扱品目（業務）名表入力例","2主要取扱品目（業務）名表入力ｼｰﾄ（兼出力ｼｰﾄ）","3清掃・警備業務経歴入力ｼｰﾄ（兼出力ｼｰﾄ）","出力ｼｰﾄ1","出力ｼｰﾄ2(登録ｶｰﾄﾞ）","リストシート"],"not_rendered":{"charts":0,"images":0,"macros":1,"external_links":1,"defined_names":45,"comments":1,"pivot_tables":0},"unopened":[],"bounds":{"document_bytes":16777216,"sheet_cells":100000,"rows_first":2000,"rows_last":500,"rows_between":2000,"halvings":0,"cell_chars":16384,"cell_head_chars":4096},"cells_cut":0,"cells_raw":0,"read":"whole","date_system":"1900"}

{"sheet":"申請について","index":0,"n_rows":105,"n_cols":6,"rows_kept":105,"cut":false,"hidden":false,"merged":[[19,0,19,8],[90,0,90,8],[107,0,107,8],[98,0,98,8],[106,0,106,8],[105,0,105,8],[104,0,104,8],[100,0,100,8],[102,0,102,8],[101,0,101,8],[99,0,99,8],[103,0,103,8],[47,0,47,8],[45,0,45,8],[36,0,36,8],[34,0,34,8],[42,3,42,4],[112,0,112,8],[108,0,108,8],[109,0,109,8],[110,0,110,8],[111,0,111,8],[56,0,56,8],[54,0,54,8],[55,0,55,8],[46,0,46,8],[44,0,44,8],[85,0,85,8],[86,0,86,8],[89,0,89,8],[88,0,88,8],[87,0,87,8],[10,0,10,8],[12,0,12,8],[16,0,16,8],[84,0,84,8],[82,0,82,8],[59,0,59,8],[61,0,61,8],[60,0,60,8],[83,0,83,8],[78,0,78,8],[79,0,79,8],[80,0,80,8],[81,0,81,8],[57,0,57,8],[50,0,50,8],[58,0,58,8],[7,0,7,8],[13,0,13,8],[0,0,0,8],[23,0,23,8],[9,0,9,8],[1,0,1,8],[3,0,3,8],[18,0,18,8],[14,0,14,8],[2,0,2,8],[15,0,15,8],[17,0,17,8],[4,0,4,8],[5,0,5,8],[6,0,6,8],[8,0,8,8],[35,0,35,8],[11,0,11,8],[42,0,42,2],[43,0,43,8],[53,0,53,8],[48,0,48,8],[49,0,49,8],[51,0,51,8],[52,0,52,8],[38,0,38,8],[37,0,37,8],[40,0,40,8],[29,0,29,8],[39,0,39,8],[42,5,42,8],[41,0,41,8]]}
[]
["令和5・6・7年度"]
["仙台市競争入札参加資格審査申請について"]
["【物品契約用】"]
["１．申請区分"]
["　　物品…物品の売買、賃貸借、印刷・製造請負、清掃・警備・その他工事関連以外の業務委託等"]
["２．競争入札参加者の資格"]
["申請者は、次に掲げる事項のすべてに該当する者でなければなりません。"]
["(1)　 地方自治法施行令（昭和22年政令第16号）第167条の4第1項各号に該当する者でないこと。"]
["※　「地方自治法施行令第167条の4第1項各号に該当する者」とは次に掲げる者をいいます。"]
["　　　・　契約を締結する能力を有しない者"]
["　　　・　破産手続き開始の決定を受けて復権を得ない者"]
["　　　・　暴力団員による不当な行為の防止等に関する法律（平成3年法律第77号）第32条第1項各号に"]
["　　　掲げる者"]
["(2)　営業に関し、許可・登録等を必要とする業種について申請する者は、関係法令に基づく許可・登録"]
["　　　等を受けていること。"]
["(3)　仙台市から課税されている市税を滞納していないこと並びに個人以外の場合にあっては、法人の　　"]
["　　市民税及び事業所税に係る市長に対する申告を行っていること（当該申告義務を有する者に限る。）。"]
["(4)　消費税及び地方消費税を滞納していないこと。"]
["※　　新型コロナウィルス感染症の影響等により納付の猶予が適用されている方は事前にご相談"]
["　　ください。"]
["(5)　「仙台市入札契約暴力団等排除要綱(平成20年10月31日市長決裁)」別表に掲げる措置要件に"]
["　　　該当しないこと。"]
["※　仙台市では、宮城県警察本部との連携のもと、仙台市が発注する全ての入札・契約から暴力団等"]
["　を排除する取り組みを実施するため、仙台市入札契約暴力団等排除要綱(平成20年10月31日市長"]
["　決裁)を制定し、平成20年11月1日から施行しています。"]
["　　当該要綱に基づき、本市の競争入札参加資格の登録を受けた方が暴力団等と関係を有することが"]
["　確認された場合、指名停止や契約解除等を行います。"]
["　（＊宮城県及び県内市町村においても、仙台市と同様の取り組みをしております。）"]
["３．申請書受付期間等"]
["(1)　受付方法　"]
["　　 新規申請：配送履歴を確認できる方法（「配達証明付書留郵便」等）により、下記受付期間"]
["　　　 　 　 　   内に郵送してください。"]
[]
["(2)　受付期間"]
["　　新規申請：令和5年12月18日（月）から令和6年1月16日（火）まで（必着）"]
[]
["４．競争入札参加資格登録日"]
["　 審査の結果、資格を有すると認められた方は、令和6年4月1日から令和8年3月31日まで"]
["競争入札参加資格者として登録されます。決定通知は令和6年3月末ごろ発送の予定です。"]
["　 申請の際に提出を求めている許可・登録証等については、有効期限内であるものが必要となります"]
["ので、下記基準日に留意のうえ提出願います。"]
["有効期限",null,null,"2024-04-01",null,"以降のもの"]
["　 更新手続き中の場合は、認定後に許可・登録証等の写しを提出してください。"]
["５．提出書類"]
["(1)　指定様式(Excelシートから出力する書類）"]
["　　　まず「１入力シート」を入力してください。次に、「２主要取扱品目（業務）名表入力シート（兼出力"]
["　　シート）」を入力し、印刷してください。次に「出力シート1」、「出力シート2」を印刷し、書類に実印"]
["　　及び使用印鑑等を押印してください。"]
["　　　「117 清掃等」（廃棄物収集運搬・処分業も含む）「118 警備」を申請する方は、「３清掃・警備業務"]
["　　経歴入力シート（兼出力シート）」にも必要事項を入力し、印刷してください。"]
["　　　指定様式は以下のとおりです。"]
["　　①　提出書類確認書"]
["　　②　記載内容確認書　　　　　　　　　　　　　"]
["　　③　仙台市競争入札参加資格審査申請書　　　　　　　　　　　　　　　　　　　　　　"]
["　　④　委任状（契約の締結等の権限に関する受任者を設置する場合のみ提出してください。）　　　　　　"]
["※ 入札参加資格の有効期間を通じて、見積り、入札及び契約の締結に関する権限を"]
[" 支店長等の特定の代理人に委任する場合のみ提出してください。委任事項は、"]
[" 委任状記載の全ての項目を委任するものとし、一部委任はできません。"]
["　　⑤　使用印鑑届"]
["　　⑥　代表者等確認書"]
["　　⑦　封筒用表紙（角２封筒に貼ってください。申請書類の保管用に使用します。）"]
["　　⑧　郵送用宛名（角２封筒に貼り申請書類を入れてください。）"]
["　　⑨　主要取扱品目（業務)名表（2枚1組）"]
["　　⑩　清掃・警備業務経歴一覧表　（「117清掃等」「118警備」を申請する方のみ）　"]
["　　⑪　仙台市競争入札参加資格業者登録カード（2枚１組）　　　　　　　　　　　　　　　　　　"]
[]
["(2)　証明書等　"]
["　　①印鑑証明書の原本（法務局が発行する代表者印の証明書）"]
["　　   ※個人の場合は、市区町村が発行する事業主本人の印鑑証明書の原本"]
["    ②履歴事項全部証明書の原本（法務局が発行する本店分の証明書）"]
["       ※個人の場合は、市区町村が発行する事業主本人の「身元（身分）証明書」の原本"]
["    ③消費税及び地方消費税について未納税額のない証明（写し可）"]
["     （本社所在地所管の税務署が発行する「納税証明書（その３）」「納税証明書（その３の２）」「納税証明"]
["      書（その３の３）」のうちいずれか１つ。）"]
["       ※納税義務の有無にかかわらず、また、設立後１年未満の法人も提出が必要です。"]
["       ※個人の場合も提出が必要です。"]
["    ④財務諸表の写し（直前２ヵ年分の貸借対照表及び損益計算書）"]
["　　   ※個人の場合は、直前２ヵ年分の収支計算書"]
["    ⑤許可（登録）証明書等の写し"]
["       ※営業に関し、法令上の許可・登録を必要とする業種について申請する場合のみ提出が必要です。"]
["６．事業協同組合等の競争入札参加資格審査申請"]
["　　事業協同組合等で競争入札参加資格審査申請を行う場合は、前記５の提出書類のほかに次の書類"]
["　の写しを提出してください。"]
["　　①　定款"]
["　　②　官公需共同受注規約"]
["　　③　役員名簿"]
["　　④　組合員名簿"]
["７．注意事項"]
["(1) 申請書を提出する前に「事前受付メール」の送付をお願いします。事前受付専用のメールアドレスは"]
["　　仙台市ホームページをご確認ください。"]
["(2) 今回競争入札参加資格審査申請された方は、別途水道局・交通局・ガス局・市立病院へ入札参加"]
["　　資格の審査を申請する必要はありません。"]
["(3) 申請できる種目数は大分類は最大5種目までで、大分類１種目につき、申請できる小分類は最大３"]
["　　種目までです。"]
["(4) 令和5・6・7年度競争入札参加資格の有効期間は、令和8年3月31日までとなります。期間の途中か"]
["　　ら資格の認定を受ける場合は、認定以後有効期間が開始されます。"]
["   　 なお、有効期間満了後も登録の継続を希望される場合は、改めて申請手続きが必要となります。"]
["   申請受付期間は令和7年10月頃を予定しております。"]
["(5) 業者登録後、競争入札参加資格者名簿を作成し登録業者名等を公表します。"]
["(6) 提出書類に虚偽の記載があった場合は、資格を認定しません。また、資格を取り消すことがあります。"]
["(7) 公的機関が発行する証明書は、登録申請前３ヶ月以内に発行された最新のものに限ります。"]
["(8) 提出いただいた書類に関して、お問い合わせする場合がございますので、提出書類一式の写しを"]
["　　とってから提出してください。"]
["(9) 受領証は発行いたしませんので、配達確認は郵便追跡サービスをご利用ください。"]

{"sheet":"1入力ｼｰﾄ","index":1,"n_rows":349,"n_cols":58,"rows_kept":349,"cut":false,"hidden":false,"merged":[[348,0,348,37],[62,4,63,37],[61,1,64,1],[168,1,171,1],[157,4,160,37],[131,2,132,3],[46,1,46,37],[40,15,40,37],[16,0,16,16],[16,17,16,37],[17,0,17,16],[17,17,17,37],[108,4,109,37],[51,14,51,37],[35,0,35,37],[38,4,39,37],[54,0,54,40],[47,2,47,3],[168,14,168,37],[145,0,145,37],[172,1,172,37],[176,4,176,6],[144,15,144,37],[171,2,171,3],[157,2,160,3],[148,2,149,3],[173,2,173,3],[167,0,177,0],[152,4,153,37],[38,0,40,1],[40,9,40,10],[51,2,51,3],[53,2,53,3],[47,1,53,1],[59,2,59,3],[55,0,55,37],[53,14,53,37],[117,1,119,1],[102,1,105,1],[102,2,102,3],[117,4,118,37],[117,2,118,3],[56,4,56,37],[66,1,69,1],[119,12,119,13],[56,2,56,3],[59,4,59,37],[60,1,60,37],[200,4,200,7],[126,0,144,0],[3,0,3,37],[4,0,4,37],[5,0,5,37],[18,17,18,37],[19,17,19,37],[12,0,12,37],[11,0,11,37],[6,0,6,37],[7,0,7,37],[8,0,8,37],[9,0,9,37],[10,0,10,37],[15,0,15,37],[13,0,13,37],[14,0,14,37],[196,2,196,3],[190,2,191,3],[193,1,193,37],[43,1,45,1],[24,17,24,37],[45,2,45,3],[34,0,34,37],[190,1,192,1],[200,9,200,37],[196,9,196,37],[196,4,196,7],[200,2,200,3],[37,0,37,37],[102,4,102,37],[40,4,40,5],[38,2,39,3],[47,4,47,12],[129,12,129,37],[62,2,63,3],[57,2,58,3],[184,0,189,0],[184,2,184,3],[187,18,188,37],[184,4,184,17],[185,2,186,3],[188,2,188,3],[194,4,195,37],[48,2,50,3],[194,2,195,3],[184,18,184,37],[192,10,192,37],[201,1,201,37],[197,1,197,37],[202,1,207,1],[206,4,206,5],[198,4,199,37],[213,4,213,5],[211,6,211,37],[213,6,213,37],[211,4,211,5],[211,2,211,3],[205,15,205,37],[205,4,205,7],[207,6,207,7],[207,2,207,3],[206,6,206,37],[205,8,205,14],[207,12,207,13],[207,15,207,37],[198,1,200,1],[202,4,203,37],[204,6,204,37],[204,4,204,5],[202,2,203,3],[198,2,199,3],[205,2,206,3],[242,18,243,37],[242,4,242,17],[242,2,242,3],[240,4,241,37],[243,4,243,17],[243,2,243,3],[214,15,214,37],[219,2,220,3],[218,4,218,37],[221,4,221,37],[221,2,221,3],[218,2,218,3],[240,2,241,3],[232,2,232,3],[237,2,237,3],[237,4,237,37],[239,4,239,17],[238,1,238,37],[239,2,239,3],[250,1,253,1],[251,4,252,37],[254,1,254,37],[255,4,255,37],[222,1,222,37],[228,1,230,1],[219,4,220,37],[230,4,230,11],[214,2,214,3],[248,4,248,37],[246,2,247,3],[249,1,249,37],[239,0,244,0],[232,1,237,1],[232,4,232,37],[231,1,231,37],[226,2,226,3],[230,2,230,3],[230,12,230,37],[226,12,226,37],[223,1,226,1],[233,4,236,37],[227,1,227,37],[224,4,225,37],[228,4,229,37],[223,2,223,3],[226,4,226,6],[223,4,223,6],[226,8,226,11],[223,8,223,11],[223,12,223,37],[244,1,244,37],[224,2,225,3],[233,2,236,3],[239,18,239,37],[239,1,241,1],[190,0,193,0],[218,1,221,1],[217,1,217,3],[185,4,186,37],[173,1,176,1],[174,4,175,37],[173,7,173,37],[181,2,181,3],[178,2,178,3],[176,7,176,37],[217,6,217,37],[214,6,214,7],[207,4,207,5],[207,9,207,10],[216,0,216,37],[217,0,238,0],[214,9,214,10],[212,15,212,37],[212,8,212,14],[209,2,210,3],[204,2,204,3],[187,2,187,3],[187,4,187,17],[215,0,215,37],[178,0,183,0],[182,2,182,3],[179,4,180,37],[182,4,182,13],[76,0,76,40],[123,4,123,6],[120,1,120,37],[119,15,119,37],[103,4,104,37],[166,4,166,7],[162,0,162,37],[166,12,166,13],[164,2,165,3],[167,1,167,37],[174,2,175,3],[178,14,178,37],[179,2,180,3],[166,15,166,37],[181,4,181,13],[181,14,181,37],[183,1,183,37],[173,4,173,6],[178,4,178,13],[100,4,100,37],[61,2,61,3],[43,0,53,0],[45,4,45,7],[43,4,44,37],[64,2,64,3],[71,1,73,1],[71,2,71,3],[66,4,66,37],[43,2,44,3],[57,4,58,37],[61,4,61,37],[56,1,59,1],[70,1,70,37],[82,2,82,3],[82,4,82,7],[80,4,81,37],[71,4,71,17],[75,2,75,3],[78,0,78,40],[80,40,81,40],[43,40,44,40],[171,4,171,13],[45,8,45,37],[88,0,88,37],[64,4,64,37],[67,4,68,37],[65,1,65,37],[72,2,73,3],[72,4,73,37],[69,4,69,37],[56,0,75,0],[67,2,68,3],[69,2,69,3],[66,2,66,3],[75,4,75,17],[79,0,79,37],[74,18,75,37],[80,2,81,3],[77,0,77,37],[80,0,82,0],[74,4,74,17],[82,8,82,37],[0,0,0,37],[40,6,40,7],[40,2,40,3],[40,12,40,13],[27,17,27,37],[28,17,28,37],[29,17,29,37],[30,17,30,37],[1,0,1,37],[22,17,22,37],[23,17,23,37],[31,17,31,37],[36,0,36,37],[20,17,20,37],[2,0,2,37],[18,0,18,16],[19,0,19,16],[20,0,20,16],[22,0,22,16],[23,0,23,16],[30,0,30,16],[31,0,31,16],[32,0,32,16],[24,0,24,16],[25,0,25,16],[28,0,28,16],[29,0,29,16],[26,0,26,16],[27,0,27,16],[90,2,94,3],[90,4,94,37],[95,2,95,3],[100,2,100,3],[89,0,100,0],[89,4,89,37],[107,4,107,37],[110,4,110,37],[97,2,97,3],[103,2,104,3],[89,1,95,1],[102,0,123,0],[119,4,119,5],[111,1,111,37],[113,2,114,3],[108,2,109,3],[95,4,95,37],[101,0,101,37],[96,1,96,37],[89,2,89,3],[121,4,122,37],[119,6,119,7],[121,2,122,3],[106,1,106,37],[161,2,161,3],[116,1,116,37],[98,4,99,37],[105,4,105,37],[146,0,146,37],[136,4,139,37],[135,4,135,37],[97,1,100,1],[98,2,99,3],[125,0,125,37],[123,7,123,37],[126,4,126,6],[123,2,123,3],[119,2,119,3],[141,2,143,3],[140,2,140,3],[135,2,135,3],[144,2,144,3],[97,4,97,37],[105,2,105,3],[115,4,115,37],[107,1,110,1],[107,2,107,3],[110,2,110,3],[124,0,124,37],[112,1,115,1],[112,2,112,3],[112,4,112,37],[121,1,123,1],[113,4,114,37],[115,2,115,3],[126,1,129,1],[126,2,126,3],[119,9,119,10],[127,4,128,37],[129,2,129,3],[129,4,129,6],[126,8,126,11],[147,4,147,6],[140,4,140,37],[141,4,143,37],[131,1,133,1],[133,4,133,11],[130,1,130,37],[136,2,139,3],[131,4,132,37],[127,2,128,3],[133,2,133,3],[135,1,140,1],[147,12,147,37],[147,8,147,11],[141,1,144,1],[134,1,134,37],[129,8,129,11],[144,4,144,13],[133,12,133,37],[156,1,161,1],[148,4,149,37],[156,2,156,3],[166,9,166,10],[166,2,166,3],[164,4,165,37],[147,1,150,1],[150,2,150,3],[156,4,156,37],[150,8,150,11],[150,12,150,37],[154,4,154,11],[154,12,154,37],[163,0,163,37],[164,0,166,1],[152,2,153,3],[147,2,147,3],[155,1,155,37],[152,1,154,1],[161,4,161,37],[154,2,154,3],[151,1,151,37],[150,4,150,6],[147,0,161,0],[169,2,170,3],[168,2,168,3],[228,2,229,3],[178,1,180,1],[189,1,189,37],[194,1,196,1],[169,4,170,37],[171,14,171,37],[168,4,168,13],[182,14,182,37],[188,4,188,17],[177,1,177,37],[176,2,176,3],[217,4,217,5],[209,4,210,37],[192,4,192,9],[190,4,191,37],[192,2,192,3],[212,4,212,7],[208,1,208,37],[212,2,213,3],[214,4,214,5],[214,12,214,13],[209,1,214,1],[256,2,257,3],[253,4,253,37],[260,4,261,37],[269,6,269,37],[266,2,266,3],[264,4,265,37],[262,6,262,7],[259,1,259,37],[245,4,245,37],[246,4,247,37],[248,2,248,3],[264,1,266,1],[245,1,248,1],[250,4,250,37],[250,2,250,3],[245,2,245,3],[258,4,258,37],[256,4,257,37],[251,2,252,3],[262,12,262,13],[255,1,258,1],[255,2,255,3],[258,2,258,3],[253,2,253,3],[293,1,293,17],[293,18,293,27],[294,21,294,27],[294,8,294,10],[287,21,287,27],[297,1,297,17],[303,1,303,17],[281,8,281,37],[296,1,296,7],[297,28,297,37],[282,8,282,17],[283,8,283,10],[284,1,284,17],[284,18,284,27],[287,1,287,7],[294,18,294,20],[287,28,287,30],[302,31,302,37],[300,31,300,37],[303,18,303,27],[303,28,303,37],[302,21,302,27],[300,28,300,30],[285,28,285,30],[301,28,301,37],[298,31,298,37],[309,0,309,37],[300,0,301,0],[308,0,308,37],[304,0,304,37],[302,28,302,30],[300,18,300,20],[302,1,302,7],[302,11,302,17],[300,21,300,27],[347,0,347,37],[285,1,285,7],[292,28,292,30],[292,8,292,10],[292,11,292,17],[287,31,287,37],[292,0,293,0],[302,8,302,10],[294,1,294,7],[346,0,346,37],[296,21,296,27],[296,28,296,30],[299,18,299,27],[298,1,298,7],[297,18,297,27],[299,28,299,37],[296,8,296,10],[292,18,292,20],[294,28,294,30],[298,0,299,0],[295,1,295,17],[292,1,292,7],[289,0,289,37],[292,31,292,37],[345,0,345,37],[339,0,339,37],[340,0,340,37],[344,0,344,37],[300,1,300,7],[342,0,342,37],[323,0,323,37],[296,31,296,37],[296,18,296,20],[298,28,298,30],[311,0,313,37],[315,3,315,5],[315,13,315,19],[306,0,306,37],[305,0,305,37],[317,0,317,37],[314,0,314,37],[315,8,315,11],[315,0,315,2],[316,0,316,37],[315,20,315,25],[302,0,303,0],[343,0,343,37],[341,0,341,37],[334,0,334,37],[338,0,338,37],[324,0,324,37],[325,0,325,37],[335,0,335,37],[318,0,318,19],[291,28,291,37],[295,18,295,27],[292,21,292,27],[295,28,295,37],[294,11,294,17],[291,18,291,27],[296,11,296,17],[337,0,337,37],[336,0,336,37],[291,1,291,7],[294,0,295,0],[321,20,322,37],[300,11,300,17],[294,31,294,37],[321,0,321,19],[322,0,322,19],[319,0,319,19],[318,20,319,37],[320,20,320,37],[290,0,291,0],[293,28,293,37],[320,0,320,19],[286,18,286,27],[287,0,288,0],[288,18,288,27],[287,8,287,10],[288,1,288,17],[290,8,290,37],[287,11,287,17],[288,28,288,37],[310,0,310,37],[307,0,307,37],[296,0,297,0],[298,18,298,20],[298,8,298,10],[298,11,298,17],[298,21,298,27],[302,18,302,20],[301,18,301,27],[299,1,299,17],[300,8,300,10],[301,1,301,17],[283,0,284,0],[285,0,286,0],[284,28,284,37],[283,21,283,27],[283,11,283,17],[283,31,283,37],[286,28,286,37],[283,28,283,30],[283,1,283,7],[286,1,286,17],[262,2,262,3],[264,2,265,3],[266,7,266,37],[268,0,268,37],[266,4,266,6],[272,18,272,37],[273,4,273,17],[274,4,274,17],[260,1,262,1],[270,4,271,37],[262,9,262,10],[262,4,262,5],[269,4,269,5],[272,4,272,17],[273,18,273,37],[263,1,263,37],[260,2,261,3],[274,2,275,3],[270,2,271,3],[270,1,271,1],[262,15,262,37],[269,1,269,3],[267,0,267,37],[245,0,266,0],[291,8,291,17],[282,18,282,27],[274,23,274,37],[287,18,287,20],[279,0,279,37],[280,0,280,37],[285,21,285,27],[290,1,290,7],[276,1,276,37],[269,0,276,0],[281,1,282,7],[285,18,285,20],[285,31,285,37],[283,18,283,20],[285,8,285,10],[285,11,285,17],[274,18,275,22],[275,4,275,17],[278,0,278,37],[272,2,272,3],[277,0,277,37],[273,2,273,3],[275,23,275,37],[282,28,282,37],[83,1,83,37],[84,1,87,1],[84,2,84,3],[84,4,84,37],[85,2,86,3],[85,4,86,37],[87,2,87,3],[87,4,87,37],[21,17,21,37],[21,0,21,16],[41,0,41,37],[80,1,82,1],[42,0,42,37],[48,4,50,37],[51,4,51,12],[52,3,52,37],[53,4,53,12],[25,17,25,37],[26,17,26,37],[33,0,33,16],[32,17,32,37],[33,17,33,37],[71,18,71,37],[74,2,74,3]]}
["仙台市競争入札参加資格審査申請用入力シート\n【物　品　契　約　用】"]
["※まず最初に「１入力シート」の該当箇所を全て入力してください。入力内容が他のシートに反映されます。"]
["　入力が必要なシートは、次の３シートです。　　　　　　　"]
["　　１　入力シート　　　　　　　　　　　　　"]
["　　　　Ⅰ　基本事項入力欄　　　　　　　　　　　　　　　　　　　　　　　　　「1入力シート」と、"]
["　　　　Ⅱ　業者情報入力欄　　　　　　　　　　　　　　　　　　　　　　　　　「2主要取扱品目（業務）名表入力シート（兼出力シート）」は、　　　　　　　　　　　　　　　　　　　　　　　"]
["　　　　Ⅲ　申請種目入力欄　　　　　　　　　　　　　　　　　　　　　　　　　すべての申請者の方が入力してください。"]
["　　２　主要取扱品目（業務）名表入力シート（兼出力シート）"]
["　　３　清掃・警備業務経歴入力シート（兼出力シート） 　― 　「117 清掃等｣（廃棄物収集運搬・処分業を含む）｢118 警備」を"]
["　　　　　　　　　　　　　　　　　　　　　　　　　　　　　　　　　　　　申請する方のみ入力してください。"]
["　　必要事項を入力後、出力シート１、２、主要取扱品目（業務）名表、清掃・警備業務経歴一覧表（「117 清掃等｣｢118 警備｣を"]
["　申請する方のみ）をプリントアウトして実印、使用印を押印し、必要書類を添付して申請してください。"]
["　提出されました書類に関してお問い合わせする場合がございますので、提出書類一式の写しをとってから提出してください。"]
["　新規申請の方 ― 提出は、「配達証明付書留郵便」等の配送履歴を確認できる方法により、受付期間内に郵送してください。"]
["　　　　　　　　　　　※受領証は発行いたしませんので、配達確認は郵便追跡サービスをご利用ください。"]
["  継続申請の方 ― 受付は終了しました。"]
["　出力シート１、２、主要取扱品目（業務）名表入力シート（兼出力\n　シート）、及び清掃・警備業務経歴入力シート（兼出力シート）から\n　プリントアウトされる書類",null,null,null,null,null,null,null,null,null,null,null,null,null,null,null,null,"添  付  書  類"]
["①「提出書類確認書」",null,null,null,null,null,null,null,null,null,null,null,null,null,null,null,null,"①印鑑証明書の原本（法務局が発行する代表者印の証明書）"]
["②「記載内容確認書」",null,null,null,null,null,null,null,null,null,null,null,null,null,null,null,null,"※個人の場合は、市区町村が発行する事業主本人の印の証明書の原本"]
["③「仙台市競争入札参加資格審査申請書」",null,null,null,null,null,null,null,null,null,null,null,null,null,null,null,null,"②履歴事項全部証明書の原本（法務局が発行する本店分の証明書）"]
["④「委任状」",null,null,null,null,null,null,null,null,null,null,null,null,null,null,null,null,"※個人の場合は、市区町村が発行する事業主本人の「身元（身分）証明書」"]
["　　　契約締結等の権限に関する受任者を設置する場合のみ提出",null,null,null,null,null,null,null,null,null,null,null,null,null,null,null,null,"の原本"]
["　　してください。",null,null,null,null,null,null,null,null,null,null,null,null,null,null,null,null,"③消費税及び地方消費税について未納税額のない証明（写し可）"]
["⑤「使用印鑑届」　",null,null,null,null,null,null,null,null,null,null,null,null,null,null,null,null,"（本社所在地所管の税務署が発行する「納税証明書（その３）」「納税証明"]
["⑥「代表者等確認書」",null,null,null,null,null,null,null,null,null,null,null,null,null,null,null,null,"書（その３の２）」「納税証明書（その３の３）」のうちいずれか１つ。）"]
["⑦「封筒用表紙」（角2封筒に貼ってください。書類保管に使用）",null,null,null,null,null,null,null,null,null,null,null,null,null,null,null,null,"※納税義務の有無にかかわらず、また、設立後一年未満の法人も提出が"]
["⑧「郵送用宛名」（角2封筒に貼ってください）　",null,null,null,null,null,null,null,null,null,null,null,null,null,null,null,null,"必要です。"]
["　　　　　　　　　　　　　　　　　　　　①～⑧出力シート１",null,null,null,null,null,null,null,null,null,null,null,null,null,null,null,null,"※個人の場合も提出が必要です。"]
["⑨「主要取扱品目（業務)名表」 主要取扱品目（業務)名表入力ｼｰﾄ（兼出力ｼｰﾄ）",null,null,null,null,null,null,null,null,null,null,null,null,null,null,null,null,"④財務諸表の写し（直前２ヵ年分の貸借対照表及び損益計算書）"]
["⑩「清掃・警備業務経歴一覧表」 清掃・警備業務経歴入力ｼｰﾄ（兼出力ｼｰﾄ）",null,null,null,null,null,null,null,null,null,null,null,null,null,null,null,null,"※個人の場合は、直前２ヵ年分の収支計算書"]
["　　　「117 清掃等」（廃棄物収集運搬・処分業を含む）「118 警備」",null,null,null,null,null,null,null,null,null,null,null,null,null,null,null,null,"⑤許可（登録）証明書等の写し"]
["　　を申請する場合のみ提出してください",null,null,null,null,null,null,null,null,null,null,null,null,null,null,null,null,"※営業に関し、法令上の許可・登録を必要とする業種について申請"]
["⑪「仙台市競争入札参加業者登録カード」(2枚1組）　 出力シート２",null,null,null,null,null,null,null,null,null,null,null,null,null,null,null,null,"する場合のみ提出が必要です。"]
[]
["　　入力例、入力上の注意をよく読んで入力してください。\n　　水色の箇所はドロップダウンリストから該当するものを選択してください。\n　　薄い緑色の箇所は入力上の注意を参考にして文字や数字を入力してください。\n　　入力するセルに設定してある文字の種類（全角や半角）は変更しないでください。\n　　最後まで入力し、Ⅵの確定ボタンを押してからプリントアウトしてください。\n　　（すべてモノクロプリントで構いません。）"]
["Ⅰ　基本事項入力欄"]
[]
["　1　申請年月日入力欄"]
["申請年月日",null,"入力上の注意",null,"申請する年月日をドロップダウンリストから選択してください。"]
[]
[null,null,"入力欄",null,"令和",null,null,null,"年",null,null,"月",null,null,"日"]
[]
["　2　申請区分・受付番号・業者番号入力欄"]
[null,"申請区分","入力上の注意",null,"申請する区分をドロップダウンリストから選択してください。"]
[]
[null,null,"入力欄",null,"新規"]
[]
[null,"受付番号\n業者番号","入力例",null,"000125990"]
[null,null,"入力上の注意",null,"継続申請の方のみ入力してください。受付番号及び業者番号は、「申請手続きのご案内」ハガキの宛名の下に記載されています。不明な場合は未入力で構いません。また、業者番号はハガキのほかに、仙台市役所ホームページ「競争入札参加資格者名簿」でも確認できます。\nhttp://www.city.sendai.jp/keyaku-kanri/jigyosha/keyaku/denshi/mebo.html",null,null,null,null,null,null,null,null,null,null,null,null,null,null,null,null,null,null,null,null,null,null,null,null,null,null,null,null,null,null,null,null,null,null,"新規･継続メッセージ"]
[null,null,null,null,null,null,null,null,null,null,null,null,null,null,null,null,null,null,null,null,null,null,null,null,null,null,null,null,null,null,null,null,null,null,null,null,null,null,null,"新規申請の方は入力しないでください。"]
[null,null,null,null,null,null,null,null,null,null,null,null,null,null,null,null,null,null,null,null,null,null,null,null,null,null,null,null,null,null,null,null,null,null,null,null,null,null,null,"継続の方は業者番号を入力してください。"]
[null,null,"受付番号",null,null,null,null,null,null,null,null,null,null,null,{"$f":"IF(E46=\"\",\"\",IF(E46=\"新規\",AN50,IF(AND(E46=\"継続\",E52=\"\"),AN52,\"\")))","v":"新規申請の方は入力しないでください。"},null,null,null,null,null,null,null,null,null,null,null,null,null,null,null,null,null,null,null,null,null,null,null,null,"継続の方は受付番号を入力してください。"]
[]
[null,null,"業者番号",null,null,null,null,null,null,null,null,null,null,null,{"$f":"IF(E46=\"\",\"\",IF(E46=\"新規\",AN50,IF(AND(E46=\"継続\",E54=\"\"),AN51,\"\")))","v":"新規申請の方は入力しないでください。"}]
[]
["　３　作成担当者入力欄\n　　（競争入札参加資格申請の担当者の情報を入力してください）"]
["担当者所属・氏名・連絡先","所 属","入力例",null,"本社　営業部"]
[null,null,"入力上の注意",null,"業者名は入力しないでください。(35字以内）\n《正》本社　総務課、東北支店　営業課　　　《誤》仙台デンキ東北支店"]
[]
[null,null,"入力欄"]
[]
[null,"氏 名","入力例",null,"東北　次郎"]
[null,null,"入力上の注意",null,"姓と名の間は1文字空けてください。(20字以内）　《正》東北　次郎　　《誤》東北次郎"]
[]
[null,null,"入力欄"]
[]
[null,"フリガナ","入力例",null,"トウホク　ジロウ"]
[null,null,"入力上の注意",null,"姓と名の間は1文字空けてください。(40字以内）　《正》トウホク　ジロウ　　《誤》トウホクジロウ"]
[]
[null,null,"入力欄"]
[]
[null,null,"入力例",null,"022-214-8124"]
[null,null,"入力上の注意",null,"局番と局番の間は「－」（ハイフン）でつないでください。(15字以内）"]
[]
[null,"電話番号","入力欄"]
[null,"ＦＡＸ番号","入力欄"]
[]
["Ⅱ　業者情報入力欄"]
[]
["　1　申請者名入力欄"]
[null,"法　人\n個　人","入力上の注意",null,"ドロップダウンリストから選択してください。"]
[]
[null,null,"入力欄"]
[]
[null,"法人番号","入力例",null,"8000020041009"]
[null,null,"入力上の注意",null,"法人の場合、法人番号を入力してください。（13桁）"]
[]
[null,null,"入力欄"]
[]
["業者名称","名　称","入力例",null,"例１：株式会社　仙台デンキ　例２：アオバ・テクノ"]
[null,null,"入力上の注意",null,"法人の種類と業者名の間は1文字空けてください。法人の種類（株式会社、有限会社等）は\n略さずに入力してください。個人は商号（商号のない場合は本人の氏名）を記入してください。(40字以内）\n\n《正》株式会社　○○建設　　　　　《正》○○建設　株式会社　　　　《正》○○商店\n《誤》株式会社○○建設　「株式会社」と業者名の間は1文字空ける　　\n《誤》㈱○○建設　　　　　　(株)は使用しない"]
[]
[]
[]
[]
[null,null,"入力欄"]
[]
[null,"フリガナ","入力例",null,"例１：センダイデンキ　例２：アオバテクノ"]
[null,null,"入力上の注意",null,"法人の種類（カブシキガイシャ等）は除いて入力してください。(50字以内）\n業者名に「・」が含まれている場合、フリガナでは除いてください。　　　"]
[]
[null,null,"入力欄"]
[]
["代　　表　　者","職　名","入力例",null,"例１：代表取締役　例２：（代表）"]
[null,null,"入力上の注意",null,"法人の場合は組織等の代表者の職名、個人の場合は(代表)と入力してください。(30字以内）"]
[]
[null,null,"入力欄"]
[]
[null,"氏　名","入力例",null,"仙台　太郎"]
[null,null,"入力上の注意",null,"姓と名の間は1文字空けてください。(20字以内）　《正》仙台　太郎　　《誤》仙台太郎"]
[]
[null,null,"入力欄"]
[]
[null,"フリガナ","入力例",null,"センダイ　タロウ"]
[null,null,"入力上の注意",null,"姓と名の間は1文字空けてください。(40字以内）　《正》センダイ　タロウ　　《誤》センダイタロウ"]
[]
[null,null,"入力欄"]
[]
[null,"生年月日","入力上の注意",null,"ドロップダウンリストから選択してください。"]
[]
[null,null,"入力欄",null,null,null,null,null,"年",null,null,"月",null,null,"日"]
[]
[null,"性　別","入力上の注意",null,"ドロップダウンリストから選択してください。"]
[]
[null,null,"入力欄"]
[]
["　2　本社所在地入力欄"]
["本　社　所　在　地","郵便番号","入力例",null,"980",null,null,"‐","0001"]
[null,null,"入力上の注意",null,"郵便区番号(3桁）、町域番号(4桁）をすべて入力してください"]
[]
[null,null,"入力欄",null,null,null,null,"‐"]
[]
[null,"都道府県\n名称","入力上の注意",null,"ドロップダウンリストから選択してください。"]
[]
[null,null,"入力欄"]
[]
[null,"市区町村\n以降","入力例",null,"仙台市青葉区国分町３‐７‐１　表小路ビル1階"]
[null,null,"入力上の注意",null,"都道府県名は入力せず、市町村名から入力してください。(55字以内）\n丁目、番地は「-」（ハイフン）に略し、算用数字（全角）で入力してください。\n方書（ビル名等）を入力する場合は、住所の間に1文字空けて入力してください。\n《正》仙台市青葉区国分町３－７－１　　《誤》宮城県仙台市青葉区国分町三丁目7番1号"]
[]
[]
[]
[null,null,"入力欄",null,null,null,null,null,null,null,null,null,null,null,null,null,null,null,null,null,null,null,null,null,null,null,null,null,null,null,null,null,null,null,null,null,null,null,null,{"$f":"IF(LEFT(E134,2)=\"04\",E141,MID(E134,4,4)&E141)","v":""}]
[null,"行政区","入力上の注意",null,"仙台市内に本社・本店を有している方は、本社・本店所在地の行政区を選択して下さい。\n宮城総合支所・秋保総合支所管内の方は、宮城総合支所または秋保総合支所を選択して下さい。"]
[]
[]
[null,null,"入力欄",null,null,null,null,null,null,null,null,null,null,null,null,{"$f":"IF(E145=0,IF(MID(E141,1,3)=\"仙台市\",AN145,\"\"),\"\")","v":""},null,null,null,null,null,null,null,null,null,null,null,null,null,null,null,null,null,null,null,null,null,null,null,"行政区を選択してください。"]
[]
["　3　登記簿上の本社所在地入力欄\n　　（上記の本社所在地と異なる場合のみ入力してください）"]
["登　記　上　の　本　社","郵便番号","入力例",null,"980",null,null,"‐","0001"]
[null,null,"入力上の注意",null,"郵便区番号(3桁）、町域番号(4桁）をすべて入力してください"]
[]
[null,null,"入力欄",null,null,null,null,"‐"]
[]
[null,"都道府県\n名称","入力上の注意",null,"ドロップダウンリストから選択してください。"]
[]
[null,null,"入力欄"]
[]
[null,"市区町村\n以降","入力例",null,"仙台市青葉区表小路１０"]
[null,null,"入力上の注意",null,"都道府県名は入力せず、市町村名から入力してください。(55字以内）\n丁目、番地は「‐」（ハイフン）に略し、算用数字（全角）で入力してください。\n方書（ビル名等）を入力する場合は、住所の間に1文字空けて入力してください。\n《正》仙台市青葉区国分町３－７－１　　《誤》仙台市青葉区国分町三丁目7番1号"]
[]
[]
[]
[null,null,"入力欄"]
[]
["　4　資本金・売上高等入力欄"]
["創業年月日",null,"入力上の注意",null,"創業年は西暦で、半角数字を入力してください。月日はドロップダウンリストから選択してください。"]
[]
[null,null,"入力欄",null,null,null,null,null,"年",null,null,"月",null,null,"日"]
["資本金"]
[null,"資本金","入力例",null,100000,null,null,null,null,null,null,null,null,null,"千円"]
[null,null,"入力上の注意",null,"千円単位で入力してください。(12桁以内。超える場合は999999999999を入力）"]
[]
[null,null,"入力欄",null,null,null,null,null,null,null,null,null,null,null,"千円"]
[]
[null,"外国資本\nの割合","入力例",null,75,null,null,"％"]
[null,null,"入力上の注意",null,"小数点以下切捨てで入力してください。外国資本なしの場合は「０」を入力してください。"]
[]
[null,null,"入力欄",null,null,null,null,"％"]
[]
["売上高","売上高","入力例",null,100000,null,null,null,null,null,null,null,null,null,"千円"]
[null,null,"入力上の注意",null,"千円単位で入力してください。(12桁以内。超える場合は999999999999を入力）"]
[]
[null,"前年度","入力欄",null,null,null,null,null,null,null,null,null,null,null,"千円"]
[null,"前々年度","入力欄",null,null,null,null,null,null,null,null,null,null,null,"千円"]
[]
["電話ＦＡＸ",null,"入力例",null,"022-214-8124"]
[null,null,"入力上の注意",null,"局番と局番の間は「－」（ハイフン）でつないでください。(15字以内）"]
[]
[null,"電話番号","入力欄"]
[null,"ＦＡＸ番号","入力欄"]
[]
["従業員数","従業員数","入力上の注意",null,"申請日の前月の1日現在で、常時雇用する従業員の人数を右詰で入力してください。\n（6桁以内。超える場合は999999を入力。派遣、パート、アルバイトは含みません。）"]
[]
[null,null,"入力欄",null,null,null,null,null,null,null,"人"]
[]
[null,"法定雇用\n障害者数","入力上の注意",null,"「障害者の雇用の促進等に関する法律」に基づき、所管の公共職業安定所に報告している6月1日現在の人数を入力してください。(4桁以内。超える場合は9999を入力。小数点以下は切り捨ててください。）"]
[null,null,null,null,null,null,null,null,null,null,null,null,null,null,null,null,null,null,null,null,null,null,null,null,null,null,null,null,null,null,null,null,null,null,null,null,null,null,null,"AN133メッセージ"]
[null,null,"入力欄",null,0,null,null,null,"人",{"$f":"IF(E197=0,\"\",IF(E193<E197,AN197,\"\"))","v":""},null,null,null,null,null,null,null,null,null,null,null,null,null,null,null,null,null,null,null,null,null,null,null,null,null,null,null,null,null,"注意！従業員数を超えています。"]
[]
[null,"実雇用\n障害者数","入力上の注意",null,"重度身体障害者または重度知的障害者を雇用している場合は、重度身体障害者または重度知的障害者\n1人につき障害者雇用2人として入力してください。（4桁以内。超える場合は9999を入力。小数点以下は\n切り捨ててください。）"]
["・障害者雇用数等",null,null,null,null,null,null,null,null,null,null,null,null,null,null,null,null,null,null,null,null,null,null,null,null,null,null,null,null,null,null,null,null,null,null,null,null,null,null,"ISOメッセージ"]
[null,null,"入力欄",null,0,null,null,null,"人",{"$f":"IF(E201=0,\"\",IF(E193<E201,AN197,\"\"))","v":""},null,null,null,null,null,null,null,null,null,null,null,null,null,null,null,null,null,null,null,null,null,null,null,null,null,null,null,null,null,"認証登録の有効期限を入力してください。"]
[null,null,null,null,null,null,null,null,null,null,null,null,null,null,null,null,null,null,null,null,null,null,null,null,null,null,null,null,null,null,null,null,null,null,null,null,null,null,null,"上記項目で「１」が入力されていません。"]
[null,"ISO\n9000\nシリーズ","入力上の注意",null,"ＩＳＯ９０００シリーズの認証・登録を受けている場合は「１」を入力して有効期限を選択してください。",null,null,null,null,null,null,null,null,null,null,null,null,null,null,null,null,null,null,null,null,null,null,null,null,null,null,null,null,null,null,null,null,null,null,"上記の基準日以降の有効期限の認証･登録証が必要です。更新手続き中の場合は上記をチェックしてください。"]
[null,null,null,null,null,null,null,null,null,null,null,null,null,null,null,null,null,null,null,null,null,null,null,null,null,null,null,null,null,null,null,null,null,null,null,null,null,null,null,"更新手続き中"]
[null,null,"入力欄",null,0,null,null,null,null,null,null,null,null,null,null,null,null,null,null,null,null,null,null,null,null,null,null,null,null,null,null,null,null,null,null,null,null,null,null,"9000入力ﾁｪｯｸ処理"]
[null,null,"入力上の注意",null,"有効期限が",null,null,null,{"$f":"申請について!D43","v":"2024-04-01"},null,null,null,null,null,null,"以降のものが有効です。",null,null,null,null,null,null,null,null,null,null,null,null,null,null,null,null,null,null,null,null,null,null,null,"基準日",{"$f":"申請について!D43","v":45383},"（申請要領から）",null,null,null,null,null,null,null,null,"「１」が選択されたときの処理",null,null,null,null,null,null,"｢1｣が選択されず有効期限が入力されたときの処理"]
[null,null,null,null,null,null,"更新手続き中の場合は、チェックを入れて更新前の有効期限を選択してください。",null,null,null,null,null,null,null,null,null,null,null,null,null,null,null,null,null,null,null,null,null,null,null,null,null,null,null,null,null,null,null,null,"入力日",{"$f":"DATEVALUE(AP207)","v":{"$error":"#VALUE!"}},{"$f":"G208&\"/\"&J208&\"/\"&M208","v":"//"},null,null,null,null,null,null,null,null,{"$f":"IF(OR(G208=0,J208=0,M208=0),AN201,AY209)","v":"認証登録の有効期限を入力してください。"},null,null,null,null,null,null,{"$f":"IF(AND(G208=0,J208=0,M208=0),\"\",AN202)","v":""}]
[null,null,"入力欄",null,"西暦",null,null,null,"年",null,null,"月",null,null,"日",{"$f":"IF(E205=1,AY207,BF207)","v":""},null,null,null,null,null,null,null,null,null,null,null,null,null,null,null,null,null,null,null,null,null,null,null,"更新\nﾁｪｯｸ",true,null,null,null,null,null,null,null,null,null,"入力された日付のﾁｪｯｸ及び申請手続き中の処理"]
[null,null,null,null,null,null,null,null,null,null,null,null,null,null,null,null,null,null,null,null,null,null,null,null,null,null,null,null,null,null,null,null,null,null,null,null,null,null,null,null,null,null,null,null,null,null,null,null,null,null,{"$f":"IF(AO206<=AO207,\"\",IF(AO208=TRUE,AN204,AN203))","v":{"$error":"#VALUE!"}}]
[null,"ISO\n14000\nシリーズ","入力上の注意",null,"ＩＳＯ１４０００シリーズの認証・登録を受けている場合は「１」を入力して有効期限を選択してください。"]
[null,null,null,null,null,null,null,null,null,null,null,null,null,null,null,null,null,null,null,null,null,null,null,null,null,null,null,null,null,null,null,null,null,null,null,null,null,null,null,"14000入力ﾁｪｯｸ処理"]
[null,null,"入力欄",null,0,null,null,null,null,null,null,null,null,null,null,null,null,null,null,null,null,null,null,null,null,null,null,null,null,null,null,null,null,null,null,null,null,null,null,"基準日",{"$f":"AO206","v":45383},null,null,null,null,null,null,null,null,null,"「１」が選択されたときの処理",null,null,null,null,null,null,"｢1｣が選択されず有効期限が入力されたときの処理"]
[null,null,"入力上の注意",null,"有効期限が",null,null,null,{"$f":"申請について!D43","v":"2024-04-01"},null,null,null,null,null,null,"以降のものが有効です。",null,null,null,null,null,null,null,null,null,null,null,null,null,null,null,null,null,null,null,null,null,null,null,"入力日",{"$f":"DATEVALUE(AP213)","v":{"$error":"#VALUE!"}},{"$f":"G215&\"/\"&J215&\"/\"&M215","v":"//"},null,null,null,null,null,null,null,null,{"$f":"IF(OR(G215=0,J215=0,M215=0),AN201,AY215)","v":"認証登録の有効期限を入力してください。"},null,null,null,null,null,null,{"$f":"IF(AND(G215=0,J215=0,M215=0),\"\",AN202)","v":""}]
[null,null,null,null," ",null,"更新手続き中の場合は、チェックを入れて更新前の有効期限を選択してください。",null,null,null,null,null,null,null,null,null,null,null,null,null,null,null,null,null,null,null,null,null,null,null,null,null,null,null,null,null,null,null,null,"更新\nﾁｪｯｸ",true,null,null,"有効期限サイン",null,null,null,null,null,null,"入力された日付のﾁｪｯｸ及び申請手続き中の処理"]
[null,null,"入力欄",null,"西暦",null,null,null,"年",null,null,"月",null,null,"日",{"$f":"IF(E212=1,AY213,BF213)","v":""},null,null,null,null,null,null,null,null,null,null,null,null,null,null,null,null,null,null,null,null,null,null,null,null,null,null,null,null,null,null,null,null,null,null,{"$f":"IF(AO212<=AO213,\"\",IF(AO214=TRUE,AN204,AN203))","v":{"$error":"#VALUE!"}}]
[]
["　5　受任者入力欄\n　　　入札参加資格の有効期間を通じて、見積り、入札及び契約の締結等に関する権限を、\n　 支店長等の特定の代理人に受任者として委任する場合のみ入力してください。"]
["支店・営業所名称・所在地","受任者を廃止する",null,null,null,null,{"$f":"IF(AN218=TRUE,AN220,\"\")","v":""},null,null,null,null,null,null,null,null,null,null,null,null,null,null,null,null,null,null,null,null,null,null,null,null,null,null,null,null,null,null,null,null,false]
[null,"名　称","入力例",null,"東北支店",null,null,null,null,null,null,null,null,null,null,null,null,null,null,null,null,null,null,null,null,null,null,null,null,null,null,null,null,null,null,null,null,null,null,"受任者廃止ﾁｪｯｸ"]
[null,null,"入力上の注意",null,"業者名は入力しないでください。(35字以内）\n※支店名・営業所名のみ入力してください。 《正》東北支店、仙台営業所　　　《誤》仙台建設東北支店",null,null,null,null,null,null,null,null,null,null,null,null,null,null,null,null,null,null,null,null,null,null,null,null,null,null,null,null,null,null,null,null,null,null,"登録されている受任者を廃止します。以下の項目には何も入力しないでください。"]
[]
[null,null,"入力欄"]
[]
[null,"郵便番号","入力例",null,"980",null,null,"‐","8671"]
[null,null,"入力上の注意",null,"郵便区番号(3桁）、町域番号(4桁）をすべて入力してください"]
[]
[null,null,"入力欄",null,null,null,null,"‐"]
[]
[null,"都道府県\n名称","入力上の注意",null,"ドロップダウンリストから選択してください。"]
[]
[null,null,"入力欄",null,null,null,null,null,null,null,null,null,null,null,null,null,null,null,null,null,null,null,null,null,null,null,null,null,null,null,null,null,null,null,null,null,null,null,null,{"$f":"IF(LEFT(E231,2)=\"04\",E238,MID(E231,4,4)&E238)","v":""}]
[]
[null,"市区町村\n以降","入力例",null,"仙台市宮城野区五輪２－１２－３５　宮城野ビル４階"]
[null,null,"入力上の注意",null,"都道府県名は入力せず、市町村名から入力してください。(55字以内）\n丁目、番地は「-」（ハイフン）に略し、算用数字（全角）で入力してください。\n方書（ビル名等）を入力する場合は、住所の間に1文字空けて入力してください。\n《正》仙台市青葉区国分町３－７－１　　《誤》宮城県仙台市青葉区国分町三丁目7番1号"]
[]
[]
[]
[null,null,"入力欄"]
[]
["電話ＦＡＸ",null,"入力例",null,"022-214-8124"]
[null,null,"入力上の注意",null,"局番と局番の間は「－」（ハイフン）でつないでください。(15字以内）"]
[]
[null,"電話番号","入力欄"]
[null,"ＦＡＸ番号","入力欄"]
[]
["支店・営業所の代表者","職　名","入力例",null,"支店長"]
[null,null,"入力上の注意",null,"支店名、営業所名は入力しないでください。(30字以内）\n　《正》支店長、所長　　《誤》東北支店長、仙台営業所長"]
[]
[null,null,"入力欄"]
[]
[null,"氏　名","入力例",null,"東北　次郎"]
[null,null,"入力上の注意",null,"姓と名の間は1文字空けてください。（30字以内）"]
[]
[null,null,"入力欄"]
[]
[null,"フリガナ","入力例",null,"トウホク　ジロウ"]
[null,null,"入力上の注意",null,"姓と名の間は1文字空けてください。(40字以内）　《正》トウホク　ジロウ　　《誤》トウホクジロウ"]
[]
[null,null,"入力欄"]
[]
[null,"生年月日","入力上の注意",null,"ドロップダウンリストから選択してください。"]
[]
[null,null,"入力欄",null,null,null,null,null,"年",null,null,"月",null,null,"日"]
[]
[null,"性　別","入力上の注意",null,"ドロップダウンリストから選択してください。"]
[]
[null,null,"入力欄"]
[]
["　6　連絡先電話番号・FAX番号入力欄\n　　　本店･本社、受任者以外の営業所等が連絡先となる場合のみ入力してください。"]
[null,"連絡先を廃止する",null,null,null,null,{"$f":"IF(AN270=TRUE,AN272,\"\")","v":""},null,null,null,null,null,null,null,null,null,null,null,null,null,null,null,null,null,null,null,null,null,null,null,null,null,null,null,null,null,null,null,null,false]
[null,null,"入力上の注意",null,"本社･受任者以外の営業所等が連絡先となる場合のみ入力してください。(15字以内）",null,null,null,null,null,null,null,null,null,null,null,null,null,null,null,null,null,null,null,null,null,null,null,null,null,null,null,null,null,null,null,null,null,null,"廃止ﾁｪｯｸ"]
[null,null,null,null,null,null,null,null,null,null,null,null,null,null,null,null,null,null,null,null,null,null,null,null,null,null,null,null,null,null,null,null,null,null,null,null,null,null,null,"登録されている連絡先を廃止します。"]
[null,"電話番号","入力欄",null,null,null,null,null,null,null,null,null,null,null,null,null,null,null,{"$f":"IF(E273=0,\"\",IF(OR(E273=E275,E273=E276),AN273,\"\"))","v":""},null,null,null,null,null,null,null,null,null,null,null,null,null,null,null,null,null,null,null,null,"本社又は受任者と同じ番号です。入力しないでください。"]
[null,"ＦＡＸ番号","入力欄",null,null,null,null,null,null,null,null,null,null,null,null,null,null,null,{"$f":"IF(E274=0,\"\",IF(OR(E274=X275,E274=X276),AN273,\"\"))","v":""}]
[null,"本店本社","電話番号",null,{"$f":"IF(E188=0,\"\",E188)","v":""},null,null,null,null,null,null,null,null,null,null,null,null,null,"FAX番号",null,null,null,null,{"$f":"IF(E189=0,\"\",E189)","v":""}]
[null,"受任者",null,null,{"$f":"IF(E243=0,\"\",E243)","v":""},null,null,null,null,null,null,null,null,null,null,null,null,null,null,null,null,null,null,{"$f":"IF(E244=0,\"\",E244)","v":""}]
[]
[]
["Ⅲ　申請種目入力欄"]
["　　大分類：入札参加を希望する順に最大５分類までドロップダウンリストから選択して下さい。\n　　小分類：入札参加を希望する順に各大分類につき最大３分類まで小分類コードを入力してください。\n　　（「競争入札参加資格審査申請要領　7.営業種目表」を参照してください。）"]
["（大分類選択・小分類入力の例）"]
[null,"大　　分　　類\n入札参加を希望する順に選択",null,null,null,null,null,null,"小　　分　　類(小分類コードを希望する順に入力してください）"]
[null,null,null,null,null,null,null,null,"第１希望",null,null,null,null,null,null,null,null,null,"第2希望",null,null,null,null,null,null,null,null,null,"第3希望"]
["第１\n希望","108 事務機器・用品",null,null,null,null,null,null,"005",null,null,{"$f":"IF(I284=0,\"\",VLOOKUP(LEFT(B284,3)&I284,小分類リスト,3,FALSE))","v":" 特殊事務機"},null,null,null,null,null,null,"004",null,null,{"$f":"IF(S284=0,\"\",VLOOKUP(LEFT(B284,3)&S284,小分類リスト,3,FALSE))","v":" 事務機"},null,null,null,null,null,null,"002",null,null,{"$f":"IF(AC284=0,\"\",VLOOKUP(LEFT(B284,3)&AC284,小分類リスト,3,FALSE))","v":" 木鋼製品"}]
[]
["第2\n希望","105 電気機械・器具",null,null,null,null,null,null,"005",null,null,{"$f":"IF(I286=0,\"\",VLOOKUP(LEFT(B286,3)&I286,小分類リスト,3,FALSE))","v":" 情報処理用機器"},null,null,null,null,null,null,"002",null,null,{"$f":"IF(S286=0,\"\",VLOOKUP(LEFT(B286,3)&S286,小分類リスト,3,FALSE))","v":" 視聴覚機器"},null,null,null,null,null,null,"001",null,null,{"$f":"IF(AC286=0,\"\",VLOOKUP(LEFT(B286,3)&AC286,小分類リスト,3,FALSE))","v":" 家電製品"}]
[]
["第3\n希望","106 精密機械",null,null,null,null,null,null,"001",null,null,{"$f":"IF(I288=0,\"\",VLOOKUP(LEFT(B288,3)&I288,小分類リスト,3,FALSE))","v":" 写真機"},null,null,null,null,null,null,"004",null,null,{"$f":"IF(S288=0,\"\",VLOOKUP(LEFT(B288,3)&S288,小分類リスト,3,FALSE))","v":" 時計"},null,null,null,null,null,null,null,null,null,{"$f":"IF(AC288=0,\"\",VLOOKUP(LEFT(B288,3)&AC288,小分類リスト,3,FALSE))","v":""}]
[]
["　大分類はドロップダウンリストから選択してください。\n　小分類コードは「競争入札参加資格審査申請要領　7.営業種目表」を参照してコードを入力してください。\n　小分類を入力後に、大分類を選択し直した場合は、小分類も入力し直してください。\n　登録できる種目数は、最大で大分類5種目、各大分類につき小分類3種目です。（これを上限として認定期間の途中で追加申請することができます。なお登録種目の辞退はできますが、変更はできません。）　"]
[null,"大　　分　　類",null,null,null,null,null,null,"小　　分　　類(小分類コードを希望する順に入力してください）",null,null,null,null,null,null,null,null,null,null,null,null,null,null,null,null,null,null,null,null,null,null,null,null,null,null,null,null,null,null,"an283ﾒｯｾｰｼﾞ"]
[null,"　　　　入札参加を希望する順に\n　　　　選択して下さい",null,null,null,null,null,null,"第１希望",null,null,null,null,null,null,null,null,null,"第2希望",null,null,null,null,null,null,null,null,null,"第3希望",null,null,null,null,null,null,null,null,null,null,"大分類を重複して選択することはできません"]
["第１\n希望",null,null,null,null,null,null,null,null,null,null,{"$f":"IF(I293=0,\"\",IF(OR(I293=S293,I293=AC293),AN294,IF(ISERROR(VLOOKUP(LEFT(B293,3)&I293,小分類リスト,3,FALSE)),AN296,VLOOKUP(LEFT(B293,3)&I293,小分類リスト,3,FALSE))))","v":""},null,null,null,null,null,null,null,null,null,{"$f":"IF(S293=0,\"\",IF(OR(S293=I293,S293=AC293),AN294,IF(ISERROR(VLOOKUP(LEFT(B293,3)&S293,小分類リスト,3,FALSE)),AN296,VLOOKUP(LEFT(B293,3)&S293,小分類リスト,3,FALSE))))","v":""},null,null,null,null,null,null,null,null,null,{"$f":"IF(AC293=0,\"\",IF(OR(AC293=I293,AC293=S293),AN294,IF(ISERROR(VLOOKUP(LEFT(B293,3)&AC293,小分類リスト,3,FALSE)),AN296,VLOOKUP(LEFT(B293,3)&AC293,小分類リスト,3,FALSE))))","v":""},null,null,null,null,null,null,null,"an285ﾒｯｾｰｼﾞ"]
[null,{"$f":"IF(B293=0,\"\",IF(OR(B293=B295,B293=B297,B293=B299,B293=B301,B293=B303),AN292,\"\"))","v":""},null,null,null,null,null,null,null,null,null,null,null,null,null,null,null,null,null,null,null,null,null,null,null,null,null,null,null,null,null,null,null,null,null,null,null,null,null,"重複して入力しています"]
["第2\n希望",null,null,null,null,null,null,null,null,null,null,{"$f":"IF(I295=0,\"\",IF(OR(I295=S295,I295=AC295),AN294,IF(ISERROR(VLOOKUP(LEFT(B295,3)&I295,小分類リスト,3,FALSE)),AN296,VLOOKUP(LEFT(B295,3)&I295,小分類リスト,3,FALSE))))","v":""},null,null,null,null,null,null,null,null,null,{"$f":"IF(S295=0,\"\",IF(OR(S295=I295,S295=AC295),AN294,IF(ISERROR(VLOOKUP(LEFT(B295,3)&S295,小分類リスト,3,FALSE)),AN296,VLOOKUP(LEFT(B295,3)&S295,小分類リスト,3,FALSE))))","v":""},null,null,null,null,null,null,null,null,null,{"$f":"IF(AC295=0,\"\",IF(OR(AC295=I295,AC295=S295),AN294,IF(ISERROR(VLOOKUP(LEFT(B295,3)&AC295,小分類リスト,3,FALSE)),AN296,VLOOKUP(LEFT(B295,3)&AC295,小分類リスト,3,FALSE))))","v":""},null,null,null,null,null,null,null,"an287ﾒｯｾｰｼﾞ"]
[null,{"$f":"IF(B295=0,\"\",IF(OR(B295=B293,B295=B297,B295=B299,B295=B301,B295=B303),AN292,\"\"))","v":""},null,null,null,null,null,null,null,null,null,null,null,null,null,null,null,null,null,null,null,null,null,null,null,null,null,null,null,null,null,null,null,null,null,null,null,null,null,"正しいコードを入力してください"]
["第3\n希望",null,null,null,null,null,null,null,null,null,null,{"$f":"IF(I297=0,\"\",IF(OR(I297=S297,I297=AC297),AN294,IF(ISERROR(VLOOKUP(LEFT(B297,3)&I297,小分類リスト,3,FALSE)),AN296,VLOOKUP(LEFT(B297,3)&I297,小分類リスト,3,FALSE))))","v":""},null,null,null,null,null,null,null,null,null,{"$f":"IF(S297=0,\"\",IF(OR(S297=I297,S297=AC297),AN294,IF(ISERROR(VLOOKUP(LEFT(B297,3)&S297,小分類リスト,3,FALSE)),AN296,VLOOKUP(LEFT(B297,3)&S297,小分類リスト,3,FALSE))))","v":""},null,null,null,null,null,null,null,null,null,{"$f":"IF(AC297=0,\"\",IF(OR(AC297=I297,AC297=S297),AN294,IF(ISERROR(VLOOKUP(LEFT(B297,3)&AC297,小分類リスト,3,FALSE)),AN296,VLOOKUP(LEFT(B297,3)&AC297,小分類リスト,3,FALSE))))","v":""}]
[null,{"$f":"IF(B297=0,\"\",IF(OR(B297=B293,B297=B295,B297=B299,B297=B301,B297=B303),AN292,\"\"))","v":""}]
["第4\n希望",null,null,null,null,null,null,null,null,null,null,{"$f":"IF(I299=0,\"\",IF(OR(I299=S299,I299=AC299),AN294,IF(ISERROR(VLOOKUP(LEFT(B299,3)&I299,小分類リスト,3,FALSE)),AN296,VLOOKUP(LEFT(B299,3)&I299,小分類リスト,3,FALSE))))","v":""},null,null,null,null,null,null,null,null,null,{"$f":"IF(S299=0,\"\",IF(OR(S299=I299,S299=AC299),AN294,IF(ISERROR(VLOOKUP(LEFT(B299,3)&S299,小分類リスト,3,FALSE)),AN296,VLOOKUP(LEFT(B299,3)&S299,小分類リスト,3,FALSE))))","v":""},null,null,null,null,null,null,null,null,null,{"$f":"IF(AC299=0,\"\",IF(OR(AC299=I299,AC299=S299),AN294,IF(ISERROR(VLOOKUP(LEFT(B299,3)&AC299,小分類リスト,3,FALSE)),AN296,VLOOKUP(LEFT(B299,3)&AC299,小分類リスト,3,FALSE))))","v":""}]
[null,{"$f":"IF(B299=0,\"\",IF(OR(B299=B293,B299=B295,B299=B297,B299=B301,B299=B303),AN292,\"\"))","v":""}]
["第5\n希望",null,null,null,null,null,null,null,null,null,null,{"$f":"IF(I301=0,\"\",IF(OR(I301=S301,I301=AC301),AN294,IF(ISERROR(VLOOKUP(LEFT(B301,3)&I301,小分類リスト,3,FALSE)),AN296,VLOOKUP(LEFT(B301,3)&I301,小分類リスト,3,FALSE))))","v":""},null,null,null,null,null,null,null,null,null,{"$f":"IF(S301=0,\"\",IF(OR(S301=I301,S301=AC301),AN294,IF(ISERROR(VLOOKUP(LEFT(B301,3)&S301,小分類リスト,3,FALSE)),AN296,VLOOKUP(LEFT(B301,3)&S301,小分類リスト,3,FALSE))))","v":""},null,null,null,null,null,null,null,null,null,{"$f":"IF(AC301=0,\"\",IF(OR(AC301=I301,AC301=S301),AN294,IF(ISERROR(VLOOKUP(LEFT(B301,3)&AC301,小分類リスト,3,FALSE)),AN296,VLOOKUP(LEFT(B301,3)&AC301,小分類リスト,3,FALSE))))","v":""}]
[null,{"$f":"IF(B301=0,\"\",IF(OR(B301=B293,B301=B295,B301=B297,B301=B299,B301=B303),AN292,\"\"))","v":""}]
[]
[]
[{"$f":"IF(出力ｼｰﾄ1!AM46=\"error\",'1入力ｼｰﾄ'!AN305,\"\")","v":""},null,null,null,null,null,null,null,null,null,null,null,null,null,null,null,null,null,null,null,null,null,null,null,null,null,null,null,null,null,null,null,null,null,null,null,null,null,null,"大分類･小分類の選択･入力に誤りがあると出力シートに反映されません。正しく選択又は入力してください。"]
["Ⅳ　主要取扱品目を「主要取扱品目（業務）名表入力シート（兼出力シート）」に\n　入力してください。　"]
["　　希望する大分類・小分類の主要取扱品目(業務）及びメーカーを「主要取扱品目（業務）名表入力例」シートを参照して入力してください。\n　　大分類・小分類はドロップダウンリストからコードを選択してください。"]
[]
["Ⅴ　「117 清掃等」「118 警備」を選択した方は、「清掃・警備業務経歴入力シート（兼出\n　力シート）」に業務経歴を入力してください。　"]
["　　希望する大分類・小分類（清掃等・警備に係るもの）の業務経歴を「主要取扱品目（業務）名表入力例」シートを参照して入力してください（清掃等には廃棄物収集運搬・処分業を含みます。）。\n　　大分類・小分類はドロップダウンリストから業務を選択してください。"]
[]
["Ⅵ　入力内容を確認後、下方の確定ボタンを押して確定を選択し、「出力シート１、２」\n　　「主要取扱品目（業務）名表入力シート(兼出力シート)」をプリントアウトしてください。\n　　「117 清掃等」「118 警備」を申請する方は、「清掃・警備業務経歴入力シート（兼出\n　　力シート）」もプリントアウトしてください（すべてモノクロプリントで構いません。）。"]
[]
[]
[]
["確定ボタン→",null,null,"未確定",null,null,null,null,"確定日時",null,null,null,"：",{"$f":"IF(D316=\"確定\",NOW(),\"\")","v":""},null,null,null,null,null,null,{"$f":"IF(D316=\"確定\",NOW(),\"\")","v":""}]
[]
["●出力シート１からプリントアウトされる書類（Ａ４版）　　（以下プリントアウトはすべてモノクロプリントで構いません。）"]
["　　①提出書類確認書"]
["　　②記載内容確認書　　　　　　　　　　　　　　　　　　　　　　　　　　　　　　　　　　　"]
["　　③仙台市競争入札参加資格審査申請書　　　　　　　　　　　　　　　　　　　　　　"]
["　　④委任状（受任者を設置しない場合は提出の必要はありません）　　　　　　",null,null,null,null,null,null,null,null,null,null,null,null,null,null,null,null,null,null,null,"実印・使用印鑑を押印して提出してください。"]
["　　⑤使用印鑑届"]
["　　⑥代表者等確認書"]
["　　⑦封筒用表紙（角２封筒に貼ってください。提出書類の保管用として使用しますので、切手は貼らないでください。）"]
["　　⑧郵送用宛名（角２封筒に貼ってください。）"]
["●主要取扱品目（業務）名表入力シート（兼出力シート）を入力後、プリントアウトしてください。"]
["　　⑨主要取扱品目（業務)名表(A４版・2枚1組）"]
["●清掃・警備業務経歴一覧表業務経歴入力シート（兼出力シート）を入力後プリントアウトしてください。"]
["　　　※「117清掃等｣（廃棄物収集運搬・処分業を含む）｢118警備」を申請する方のみ。"]
["　　⑩清掃・警備業務経歴一覧表"]
["●出力シート２からプリントアウトされる書類"]
["　　⑪仙台市競争入札参加資格業者登録カード（A3版・2枚1組）"]
[]
["　　"]
[]
["上記書類に下記の証明書等を添付して申請してください。（①～③は申請前３ケ月以内に発行の最新のもの）"]
["　　①「印鑑証明書」（原本）"]
["    　　法人は法務局発行の代表者印の証明書（原本）　"]
["　　　　個人は市区町村長発行の事業主の印の証明書（原本）"]
["　　②法人は法務局発行の「履歴事項全部証明書（本店分）」(原本）"]
["　　　　個人は市区町村長発行の「身元（身分）証明書」（原本）"]
["　　③「消費税及び地方消費税について未納税額のない証明」（写し可）"]
["　　　　⇒　納税証明書「その３」「その３の２」「その３の３」のうちのいずれか１つ"]
["　　④「財務諸表｣(直前２ヵ年の営業年度分）　（写し）"]
["　　　　法人は貸借対照表及び損益計算書"]
["　　　　個人は収支計算書"]
["　　⑤「許可（登録）証明書」（写し）"]
["　　　　営業に関し法令上の許可・登録を必要とする業種を申請する方のみ提出してください。"]

{"sheet":"営業種目ｺｰﾄﾞ一覧表","index":2,"n_rows":33,"n_cols":10,"rows_kept":33,"cut":false,"hidden":false,"merged":[[0,0,0,9],[1,0,1,1],[1,2,3,2],[1,4,4,4],[2,0,10,0],[5,6,12,6],[6,4,15,4],[13,6,13,7],[11,0,11,1],[12,0,17,0],[13,2,13,3],[2,8,2,9],[4,2,4,3],[4,6,4,7],[5,2,12,2],[5,4,5,5],[19,0,24,0],[20,4,20,5],[17,4,19,4],[23,2,31,2],[25,0,25,1],[18,0,18,1],[22,2,22,3],[26,0,31,0],[27,4,27,5],[30,6,31,6],[31,4,31,5],[17,6,17,7],[14,2,21,2],[15,6,15,7],[16,4,16,5],[21,4,26,4],[18,6,28,6],[29,6,29,7]]}
["営業種目(大分類・小分類）コード一覧表"]
["101 医療・衛生",null,null,"007　工具・部品",null,"010　鉄工加工品",null,"001　食料品",null,"003　廃棄物処理"]
[null,"001　医薬品・衛生材料",null,"008　各種プラント・システム",null,"011　鋳鉄・鉄蓋",null,"002　農園芸材料","118 警　備"]
[null,"002　医療機械器具",null,"009　ガス・石油機器",null,"012　塩ビ・ゴム・プラスチック製品",null,"003　動物",null,"001　警備"]
[null,"003　レントゲン機械器具","105 電気機械・器具",null,null,"013　塗料・接着剤","113 輸送機器"]
[null,"004　歯科用医療器材・薬品",null,"001　家電製品","108 事務機器・用品",null,null,"001　自動車"]
[null,"005　歯科技工",null,"002　視聴覚機器",null,"001　紙",null,"002　大型；特殊車"]
[null,"006　防疫剤・農業薬品",null,"003　通信機器",null,"002　木鋼製品",null,"003　地下鉄"]
[null,"007　動物用医療器材・薬品",null,"004　照明機器",null,"003　文具",null,"004　自動車部品"]
[null,"008　工業薬品",null,"005　情報処理用機器",null,"004　事務機",null,"005　自動車修理"]
[null,"009　試薬",null,"006　情報処理用品",null,"005　特殊事務機",null,"006　二輪車"]
["102 衣料・繊維",null,null,"007　産業用電気機械・部品",null,"006　図書",null,"007　タイヤ"]
[null,"001　寝具",null,"008　バッテリー",null,"007　学校等教材教具",null,"008　船舶・航空機"]
[null,"002　帆布","106 精密機械",null,null,"008　運動用具","114 その他物品販売"]
[null,"003　染色",null,"001　写真機",null,"009　印",null,"001　その他物品販売（電力のみ）"]
[null,"004　被服・縫製",null,"002　Ｄ・Ｐ・E",null,"010　遊具","115 不用品買受"]
[null,"005　皮革・ゴム製品",null,"003　楽器","109 消防・標識",null,null,"001　不用品買受"]
[null,"006　室内装飾",null,"004　時計",null,"001　消防・保安","116 サービス"]
["103 印刷・製本",null,null,"005　ミシン",null,"002　標識",null,"001　情報処理"]
[null,"001　一般印刷",null,"006　試験実験機器",null,"003　看板・標示板",null,"002　ＯＡ機器賃貸"]
[null,"002　フォーム印刷",null,"007　計測量機器","110 日用品・ギフト用品",null,null,"003　その他賃貸"]
[null,"003　特殊印刷",null,"008　公害関係機器",null,"001　金物・雑貨",null,"004　運送"]
[null,"004　地図・航空写真","107 資　材",null,null,"002　清掃器材",null,"005　害虫駆除"]
[null,"005　製本",null,"001　コンクリート二次製品",null,"003　陶磁器・漆器",null,"006　クリーニング"]
[null,"006　複写・青写真焼付け",null,"002　ヒューム管",null,"004　記章・カップ",null,"007　広告宣伝"]
["104 機械・器具",null,null,"003　骨材・石材",null,"005　ギフト用品",null,"008　各種検査"]
[null,"001  土木建築用機械器具",null,"004　道路材",null,"006　美術・工芸品",null,"009　各種調査"]
[null,"002　農業用機械器具",null,"005　建材・木材","111 燃料",null,null,"010　機械保守点検"]
[null,"003　ボイラー・空調機器",null,"006　給排水資材",null,"001　石油燃料",null,"011　その他サービス"]
[null,"004　厨房用機械器具",null,"007　電設資材",null,"002　石炭・プロパン","117 清掃等"]
[null,"005　産業用機械器具",null,"008　ガス供給資材",null,"003　潤滑油",null,"001　ビルメンテナンス"]
[null,"006　工作用機械器具",null,"009　鋼材","112 農林水産",null,null,"002　その他清掃"]
[null,"※各営業種目の詳細は、「競争入札参加資格審査申請要領」内の「営業種目表」を参照してください。"]

{"sheet":"主要取扱品目（業務）名表入力例","index":3,"n_rows":106,"n_cols":45,"rows_kept":106,"cut":false,"hidden":false,"merged":[[104,44,104,45],[104,0,104,5],[104,6,104,15],[104,16,104,20],[104,21,104,22],[104,23,104,28],[104,29,104,38],[103,0,103,5],[105,39,105,43],[105,44,105,45],[105,0,105,5],[105,6,105,15],[105,16,105,20],[105,21,105,22],[105,23,105,28],[105,29,105,38],[104,39,104,43],[102,21,102,22],[41,0,41,5],[103,23,103,28],[13,18,15,22],[13,4,15,17],[101,0,101,5],[101,16,101,20],[101,21,101,22],[13,0,15,1],[31,2,33,3],[101,23,101,28],[102,6,102,15],[48,0,48,5],[49,0,49,5],[50,0,50,5],[51,0,51,5],[42,0,42,5],[43,0,43,5],[44,0,44,5],[45,0,45,5],[46,0,46,5],[47,0,47,5],[100,0,100,45],[103,39,103,43],[28,0,30,1],[28,2,30,3],[103,6,103,15],[103,16,103,20],[103,21,103,22],[34,27,36,40],[41,22,41,45],[22,27,24,40],[34,23,36,24],[31,18,33,22],[28,18,30,22],[40,22,40,45],[28,25,30,26],[39,0,39,45],[25,0,27,1],[25,2,27,3],[28,4,30,17],[102,16,102,20],[102,0,102,5],[31,4,33,17],[25,4,27,17],[103,44,103,45],[101,6,101,15],[102,23,102,28],[102,29,102,38],[101,39,101,43],[102,39,102,43],[102,44,102,45],[101,44,101,45],[101,29,101,38],[103,29,103,38],[16,41,18,45],[28,41,30,45],[28,27,30,40],[31,41,33,45],[44,22,44,45],[38,43,38,45],[25,41,27,45],[38,37,38,39],[56,22,56,45],[69,39,69,45],[82,36,83,41],[82,42,82,43],[83,42,83,43],[83,44,83,45],[84,26,85,35],[81,42,81,43],[51,22,51,45],[9,0,9,1],[9,2,9,3],[19,41,21,45],[13,41,15,45],[13,23,15,24],[10,41,12,45],[19,27,21,40],[10,27,12,40],[10,0,12,1],[10,2,12,3],[10,4,12,17],[10,18,12,22],[13,27,15,40],[19,25,21,26],[5,0,7,0],[5,1,5,3],[6,4,6,10],[6,18,6,24],[6,25,6,31],[5,32,5,38],[6,1,6,3],[5,4,5,10],[9,27,9,40],[6,11,6,17],[5,11,5,17],[7,11,7,17],[5,39,5,45],[7,25,7,31],[9,18,9,22],[9,23,9,24],[9,25,9,26],[9,4,9,17],[8,0,8,45],[7,32,7,38],[7,18,7,24],[7,4,7,10],[6,32,6,38],[9,41,9,45],[3,4,3,10],[3,11,3,17],[3,18,3,24],[4,4,4,10],[7,39,7,45],[6,39,6,45],[2,43,2,45],[3,25,3,31],[3,32,3,38],[3,39,3,45],[2,0,2,27],[2,28,2,33],[2,34,2,36],[2,37,2,39],[3,0,4,3],[2,40,2,42],[4,32,4,38],[4,18,4,24],[4,11,4,17],[4,39,4,45],[4,25,4,31],[7,1,7,3],[5,18,5,24],[5,25,5,31],[22,2,24,3],[22,4,24,17],[22,18,24,22],[19,0,21,1],[19,2,21,3],[22,0,24,1],[16,23,18,24],[16,25,18,26],[16,27,18,40],[19,23,21,24],[16,0,18,1],[16,2,18,3],[16,4,18,17],[16,18,18,22],[40,0,40,21],[38,28,38,33],[31,0,33,1],[31,27,33,40],[34,4,36,17],[34,18,36,22],[31,23,33,24],[38,34,38,36],[10,23,12,24],[10,25,12,26],[19,4,21,17],[19,18,21,22],[28,23,30,24],[25,25,27,26],[25,23,27,24],[25,18,27,22],[13,2,15,3],[13,25,15,26],[38,0,38,27],[22,25,24,26],[22,23,24,24],[34,25,36,26],[31,25,33,26],[25,27,27,40],[52,0,52,21],[60,0,60,10],[60,11,60,14],[57,22,57,45],[54,15,54,21],[52,22,52,45],[53,22,53,45],[51,6,51,18],[53,15,53,21],[54,0,54,10],[51,19,51,21],[54,11,54,14],[53,11,53,14],[56,0,56,10],[56,11,56,14],[59,0,59,10],[57,0,57,10],[58,0,58,10],[59,11,59,14],[55,0,55,10],[53,0,53,10],[54,22,54,45],[55,15,55,21],[55,11,55,14],[55,22,55,45],[62,0,62,10],[61,15,61,21],[64,0,64,10],[69,25,69,31],[63,15,63,21],[61,11,61,14],[64,15,64,21],[63,0,63,10],[57,11,57,14],[60,15,60,21],[68,0,68,27],[69,0,70,3],[58,11,58,14],[63,11,63,14],[65,0,65,10],[65,11,65,14],[61,0,61,10],[62,11,62,14],[64,11,64,14],[70,39,70,45],[70,25,70,31],[71,18,71,24],[68,37,68,39],[68,34,68,36],[58,22,58,45],[62,22,62,45],[68,28,68,33],[68,40,68,42],[58,15,58,21],[59,15,59,21],[64,22,64,45],[63,22,63,45],[65,15,65,21],[62,15,62,21],[73,1,73,3],[73,4,73,10],[73,11,73,17],[72,4,72,10],[68,43,68,45],[77,0,77,2],[69,18,69,24],[71,4,71,10],[70,18,70,24],[71,11,71,17],[69,11,69,17],[70,4,70,10],[70,32,70,38],[72,11,72,17],[72,18,72,24],[72,32,72,38],[70,11,70,17],[74,0,75,11],[74,12,75,45],[76,3,77,8],[76,9,77,10],[76,0,76,2],[69,4,69,10],[69,32,69,38],[71,0,73,0],[76,36,77,41],[76,42,76,45],[78,44,78,45],[78,36,79,41],[79,42,79,43],[77,42,77,45],[78,26,79,35],[76,26,77,35],[72,25,72,31],[73,32,73,38],[78,3,79,8],[76,11,77,20],[76,21,77,25],[73,25,73,31],[73,18,73,24],[71,32,71,38],[78,42,78,43],[71,25,71,31],[71,39,71,45],[73,39,73,45],[72,39,72,45],[71,1,71,3],[72,1,72,3],[80,0,80,2],[80,3,81,8],[81,0,81,2],[80,11,81,20],[83,0,83,2],[82,21,83,25],[79,0,79,2],[78,0,78,2],[82,9,83,10],[80,9,81,10],[78,21,79,25],[78,11,79,20],[78,9,79,10],[82,0,82,2],[82,3,83,8],[82,11,83,20],[84,9,85,10],[84,3,85,8],[81,44,81,45],[80,21,81,25],[80,26,81,35],[80,44,80,45],[80,36,81,41],[80,42,80,43],[79,44,79,45],[88,0,88,2],[88,3,89,8],[90,0,90,2],[84,44,84,45],[86,42,86,43],[86,36,87,41],[84,36,85,41],[84,42,84,43],[87,42,87,43],[87,44,87,45],[85,44,85,45],[87,0,87,2],[86,11,87,20],[86,26,87,35],[86,44,86,45],[85,42,85,43],[84,21,85,25],[86,0,86,2],[86,3,87,8],[86,9,87,10],[86,21,87,25],[84,11,85,20],[84,0,84,2],[85,0,85,2],[99,0,99,2],[99,42,99,43],[99,44,99,45],[98,3,99,8],[98,9,99,10],[98,0,98,2],[98,21,99,25],[98,26,99,35],[98,36,99,41],[96,0,96,2],[96,3,97,8],[97,0,97,2],[95,0,95,2],[65,22,65,45],[57,15,57,21],[94,44,94,45],[97,44,97,45],[96,44,96,45],[94,26,95,35],[89,42,89,43],[91,44,91,45],[92,42,92,43],[93,42,93,43],[91,42,91,43],[88,36,89,41],[90,36,91,41],[95,44,95,45],[88,21,89,25],[88,26,89,35],[90,42,90,43],[90,44,90,45],[89,44,89,45],[88,44,88,45],[94,0,94,2],[94,3,95,8],[0,0,1,45],[42,22,42,45],[34,41,36,45],[34,0,36,1],[34,2,36,3],[94,36,95,41],[94,9,95,10],[94,11,95,20],[88,42,88,43],[92,36,93,41],[90,26,91,35],[90,21,91,25],[92,0,92,2],[90,3,91,8],[91,0,91,2],[92,9,93,10],[93,0,93,2],[92,3,93,8],[92,21,93,25],[92,26,93,35],[89,0,89,2],[88,9,89,10],[22,41,24,45],[38,40,38,42],[98,42,98,43],[98,11,99,20],[98,44,98,45],[95,42,95,43],[93,44,93,45],[92,44,92,45],[96,9,97,10],[96,36,97,41],[96,42,96,43],[97,42,97,43],[96,21,97,25],[56,15,56,21],[94,21,95,25],[94,42,94,43],[96,11,97,20],[96,26,97,35],[88,11,89,20],[92,11,93,20],[90,9,91,10],[90,11,91,20],[82,44,82,45],[82,26,83,35],[48,22,48,45],[47,22,47,45],[50,22,50,45],[47,19,47,21],[48,19,48,21],[49,19,49,21],[41,19,41,21],[42,19,42,21],[43,19,43,21],[44,19,44,21],[45,19,45,21],[46,19,46,21],[46,22,46,45],[43,22,43,45],[45,22,45,45],[49,22,49,45],[50,19,50,21],[41,6,41,18],[42,6,42,18],[43,6,43,18],[44,6,44,18],[45,6,45,18],[47,6,47,18],[48,6,48,18],[49,6,49,18],[50,6,50,18],[46,6,46,18]]}
["「主要取扱品目（業務）名表」の入力例です。業務経歴入力シートの入力例は下にあります。"]
[]
["株式会社　青葉総合商会",null,null,null,null,null,null,null,null,null,null,null,null,null,null,null,null,null,null,null,null,null,null,null,null,null,null,null,null,null,null,null,null,null,"県内",null,null,108,null,null,"005",null,null,"アオ"]
["大分類",null,null,null,"第1希望",null,null,null,null,null,null,"第2希望",null,null,null,null,null,null,"第3希望",null,null,null,null,null,null,"第4希望",null,null,null,null,null,null,"第5希望"]
[null,null,null,null,{"$f":"'1入力ｼｰﾄ'!B284","v":"108 事務機器・用品"},null,null,null,null,null,null,{"$f":"'1入力ｼｰﾄ'!B286","v":"105 電気機械・器具"},null,null,null,null,null,null,{"$f":"'1入力ｼｰﾄ'!B288","v":"106 精密機械"},null,null,null,null,null,null,"103 印刷・製本",null,null,null,null,null,null,"116　サービス"]
["小分類","第1希望",null,null,"005 特殊事務機",null,null,null,null,null,null,"005 情報処理用機器",null,null,null,null,null,null,"001 写真機",null,null,null,null,null,null,"003 特殊印刷",null,null,null,null,null,null,"001　情報処理"]
[null,"第2希望",null,null,"004 事務機",null,null,null,null,null,null,"001 家電製品",null,null,null,null,null,null,"004 時計",null,null,null,null,null,null,null,null,null,null,null,null,null,"011　その他サービス"]
[null,"第3希望",null,null,"002 木鋼製品"]
[]
["大分類",null,"小分類",null,"主要取扱品目または業務名",null,null,null,null,null,null,null,null,null,null,null,null,null,"メーカー名",null,null,null,null,"大分類",null,"小分類",null,"主要取扱品目または業務名",null,null,null,null,null,null,null,null,null,null,null,null,null,"メーカー名"]
[108,null,"005",null,"印刷機器及び印刷物跡処理機、自動販売機、券売機、コインロッカー、選挙用品、ドライシーラー",null,null,null,null,null,null,null,null,null,null,null,null,null,"○○事務機、\n△△事務",null,null,null,null,116,null,"011",null,"給食業務（食堂、病院等）、医療事務、人材派遣、翻訳、保健指導、運転代行、各種研修（ＩＴ、人材育成）",null,null,null,null,null,null,null,null,null,null,null,null,null,"自社"]
[]
[]
[108,null,"004",null,"複写機、簡易印刷機、シュレッダー、製本機、裁断機、紙折機",null,null,null,null,null,null,null,null,null,null,null,null,null,"同上",null,null,null,null,116,null,"011",null,"火災保険、損害保険、訪問介護、貸切バス、イベント企画運営、古文書等修復、コールセンター業務",null,null,null,null,null,null,null,null,null,null,null,null,null,"自社"]
[]
[]
[108,null,"002",null,"机、椅子、応接セット、ロッカー、キャビネット、カウンター、金庫、黒板、舞台大道具",null,null,null,null,null,null,null,null,null,null,null,null,null,"同上"]
[]
[]
[105,null,"005",null,"サーバ、ネットワーク機器、パソコン、プリンタ",null,null,null,null,null,null,null,null,null,null,null,null,null,"○○電子、\n○△オフィス"]
[]
[]
[105,null,"001",null,"液晶テレビ、LED照明、冷暖房空調機、調理用電気器具（冷蔵庫、洗濯機、電子レンジ）",null,null,null,null,null,null,null,null,null,null,null,null,null,"○○電工、\n○△電機"]
[]
[]
[106,null,"001",null,"カメラ、映写機（8ミリ、16ミリ）、望遠鏡、双眼鏡",null,null,null,null,null,null,null,null,null,null,null,null,null,"△△カメラ"]
[]
[]
[106,null,"004",null,"時計、設備時計、貴金属",null,null,null,null,null,null,null,null,null,null,null,null,null,"○○精密機器"]
[]
[]
[103,null,"003",null,"偽造防止印刷、情報保護シール",null,null,null,null,null,null,null,null,null,null,null,null,null,"自社"]
[]
[]
[116,null,"001",null,"各業務システムの開発・運用保守、データ入力",null,null,null,null,null,null,null,null,null,null,null,null,null,"自社"]
[]
[]
[]
["仙台商事　株式会社",null,null,null,null,null,null,null,null,null,null,null,null,null,null,null,null,null,null,null,null,null,null,null,null,null,null,null,null,null,null,null,null,null,"県内",null,null,105,null,null,"001",null,null,"セン"]
[]
["代理店・特約店・仕入れ先関係等",null,null,null,null,null,null,null,null,null,null,null,null,null,null,null,null,null,null,null,null,null,"そ　　　の　　　他"]
["相手方業者名",null,null,null,null,null,"主　　な　　品　　名",null,null,null,null,null,null,null,null,null,null,null,null,"契約内容",null,null,"※大分類103｢印刷･製本」を取引希望営業種目として申請する方は、所有する印刷、製本"]
["○○電気㈱",null,null,null,null,null,"テレビ・ビデオほか家電製品",null,null,null,null,null,null,null,null,null,null,null,null,"代理店",null,null,"　用の機械の種類と台数を記載してください。"]
["㈱××電気設備",null,null,null,null,null,"テレビ、ビデオ、放送設備機器",null,null,null,null,null,null,null,null,null,null,null,null,"代理店",null,null,"※大分類111「燃料」を取引希望営業種目として申請する方で、仙台市内及びその近辺に"]
["△△電気㈱",null,null,null,null,null,"パソコン、サーバー、パソコン周辺機器",null,null,null,null,null,null,null,null,null,null,null,null,"特約店",null,null,"　ガソリンスタンドを有している方は、そのすべての名称、所在地の住所を記載してください。"]
["㈱○×石油",null,null,null,null,null,"ガソリン・軽油・灯油・オイル・プロパンガス",null,null,null,null,null,null,null,null,null,null,null,null,"特約店",null,null,"※大分類116「サービス業」の小分類004「運送」を取引希望営業種目として申請する方は、"]
["×△写真機㈱",null,null,null,null,null,"プロジェクター、モニター、カメラ、レンズ",null,null,null,null,null,null,null,null,null,null,null,null,"代理店",null,null,"　所有する運送用車両の種類と台数を記載してください。"]
["㈱□□商事",null,null,null,null,null,"パソコン、メモリーカード、デジタルカメラ、家電製品",null,null,null,null,null,null,null,null,null,null,null,null,"代理店",null,null,"※書ききれない場合は、別紙を添付していただいてもけっこうです。"]
["㈱△厨房",null,null,null,null,null,"調理用機器、食器洗浄・消毒機器、冷凍冷蔵庫",null,null,null,null,null,null,null,null,null,null,null,null,"特約店",null,null,"（例：印刷）　"]
["㈱□△○製作所",null,null,null,null,null,"旋盤、溶接機、発電機",null,null,null,null,null,null,null,null,null,null,null,null,"仕入れ先",null,null,"　　Ａ全判オフセット４色機　1台"]
["○△㈱",null,null,null,null,null,"苛性ソーダほか薬品",null,null,null,null,null,null,null,null,null,null,null,null,"代理店",null,null,"　　フォーム印刷機　１台"]
[null,null,null,null,null,null,null,null,null,null,null,null,null,null,null,null,null,null,null,null,null,null,"　　カラーオンデマンド　１台"]
["許 可 ・ 認 可 ・ 登 録　等　　（各許認可登録証等の写しを添付すること）",null,null,null,null,null,null,null,null,null,null,null,null,null,null,null,null,null,null,null,null,null,"　　無線綴製本機　１台"]
["許　可　等　の　名　称",null,null,null,null,null,null,null,null,null,null,"許可等年月日",null,null,null,"許 可 等 番 号"]
["建築物環境衛生総合管理業登録",null,null,null,null,null,null,null,null,null,null,"2014-05-01",null,null,null,"宮城県26総第15号",null,null,null,null,null,null,"（例：ガソリンスタンド）"]
["警備業",null,null,null,null,null,null,null,null,null,null,"2013-07-01",null,null,null,"第22099999号",null,null,null,null,null,null,"　　青葉給油所　仙台市青葉区国分町3-7-1"]
["一般労働者派遣業",null,null,null,null,null,null,null,null,null,null,"2010-04-01",null,null,null,"般22－9999999",null,null,null,null,null,null,"　　太白給油所　仙台市太白区秋保町△△字○○123"]
["産業廃棄物収集運搬業許可（○県）",null,null,null,null,null,null,null,null,null,null,"2011-09-20",null,null,null,"0400099801"]
["産業廃棄物処分業許可（△□市）",null,null,null,null,null,null,null,null,null,null,"2011-10-01",null,null,null,"0404199999",null,null,null,null,null,null,"（例：運送）"]
["古物営業許可",null,null,null,null,null,null,null,null,null,null,"1988-12-01",null,null,null,"221060000000号",null,null,null,null,null,null,"　　２ｔトラック　３台"]
["一般貨物自動車運送事業",null,null,null,null,null,null,null,null,null,null,"1960-06-02",null,null,null,"仙陸自貨第９９９９９号",null,null,null,null,null,null,"　　４ｔ保冷車　２台"]
["揮発油販売業者登録",null,null,null,null,null,null,null,null,null,null,"1977-08-23",null,null,null,"仙54321号",null,null,null,null,null,null,"　１０ｔトラック　１台"]
["毒物劇物一般販売業",null,null,null,null,null,null,null,null,null,null,"2010-06-03",null,null,null,"Ｑ34567号"]
[]
[]
[]
[]
[]
["株式会社　北日本オフィスメンテナンス",null,null,null,null,null,null,null,null,null,null,null,null,null,null,null,null,null,null,null,null,null,null,null,null,null,null,null,null,null,null,null,null,null,"県内",null,null,118,null,null,"001",null,null,"キタ"]
["大分類",null,null,null,"第1希望",null,null,null,null,null,null,"第2希望",null,null,null,null,null,null,"第3希望",null,null,null,null,null,null,"第4希望",null,null,null,null,null,null,"第5希望"]
[null,null,null,null,"118 警備",null,null,null,null,null,null,"117　清掃等",null,null,null,null,null,null,"116 サービス",null,null,null,null,null,null,"110 日用品･ｷﾞﾌﾄ用品",null,null,null,null,null,null,"109 消防・標識"]
["小分類","第1希望",null,null,"001 警備",null,null,null,null,null,null,"001 ビルメンテナンス",null,null,null,null,null,null,"009 各種調査",null,null,null,null,null,null,"002 清掃器材",null,null,null,null,null,null,"001 消防･保安"]
[null,"第2希望",null,null,null,null,null,null,null,null,null,"002 その他清掃",null,null,null,null,null,null,"011 その他サービス",null,null,null,null,null,null,null,null,null,null,null,null,null,"002 標識"]
[null,"第3希望",null,null,null,null,null,null,null,null,null,"003 廃棄物処理"]
["業　務　経　歴",null,null,null,null,null,null,null,null,null,null,null,"申請日以前2ヵ年程度の期間に完了した官公庁（独立行政法人を含む）・民間おける主な業務経歴を記載してください。宮城県内・近接県内官公庁発注の元請業務を中心に記載してください。"]
[]
["大分類",null,null,"発　注　者",null,null,null,null,null,"元請\n下請",null,"業　　務　　名",null,null,null,null,null,null,null,null,null,"履行場所\n(都道府県名)",null,null,null,null,"業　務　概　要",null,null,null,null,null,null,null,null,null,"請負金額(千円)",null,null,null,null,null,"着手年月"]
["小分類",null,null,null,null,null,null,null,null,null,null,null,null,null,null,null,null,null,null,null,null,null,null,null,null,null,null,null,null,null,null,null,null,null,null,null,null,null,null,null,null,null,"完了年月"]
["警　備",null,null,"宮城県",null,null,null,null,null,"元請",null,"○○センター警備業務",null,null,null,null,null,null,null,null,null,"宮城県",null,null,null,null,"常駐及び機械警備",null,null,null,null,null,null,null,null,null,4500,null,null,null,null,null,"02",null,"04"]
["警　備",null,null,null,null,null,null,null,null,null,null,null,null,null,null,null,null,null,null,null,null,null,null,null,null,null,null,null,null,null,null,null,null,null,null,null,null,null,null,null,null,null,"03",null,"03"]
["警　備",null,null,"仙台市",null,null,null,null,null,"元請",null,"仙台市○△会館警備業務",null,null,null,null,null,null,null,null,null,"宮城県",null,null,null,null,"同上",null,null,null,null,null,null,null,null,null,3618,null,null,null,null,null,"02",null,"04"]
["警　備",null,null,null,null,null,null,null,null,null,null,null,null,null,null,null,null,null,null,null,null,null,null,null,null,null,null,null,null,null,null,null,null,null,null,null,null,null,null,null,null,null,"03",null,"03"]
["警　備",null,null,"㈱みちのく",null,null,null,null,null,"元請",null,"みちのくビル警備業務",null,null,null,null,null,null,null,null,null,"宮城県",null,null,null,null,"施設常駐警備",null,null,null,null,null,null,null,null,null,2150,null,null,null,null,null,"02",null,"01"]
["警　備",null,null,null,null,null,null,null,null,null,null,null,null,null,null,null,null,null,null,null,null,null,null,null,null,null,null,null,null,null,null,null,null,null,null,null,null,null,null,null,null,null,"03",null,"12"]
["清　掃",null,null,"仙台市",null,null,null,null,null,"元請",null,"仙台市○○センター清掃業務",null,null,null,null,null,null,null,null,null,"宮城県",null,null,null,null,"清掃",null,null,null,null,null,null,null,null,null,1550,null,null,null,null,null,"02",null,"04"]
["ビルメンテ",null,null,null,null,null,null,null,null,null,null,null,null,null,null,null,null,null,null,null,null,null,null,null,null,null,null,null,null,null,null,null,null,null,null,null,null,null,null,null,null,null,"03",null,"03"]
["清　掃",null,null,"○○大学",null,null,null,null,null,"元請",null,"○○大学△□館清掃業務",null,null,null,null,null,null,null,null,null,"宮城県",null,null,null,null,"同上",null,null,null,null,null,null,null,null,null,972,null,null,null,null,null,"02",null,"04"]
["ビルメンテ",null,null,null,null,null,null,null,null,null,null,null,null,null,null,null,null,null,null,null,null,null,null,null,null,null,null,null,null,null,null,null,null,null,null,null,null,null,null,null,null,null,"03",null,"03"]
["清　掃",null,null,"仙台市",null,null,null,null,null,"元請",null,"仙台市○△センター貯水槽清掃業務",null,null,null,null,null,null,null,null,null,"宮城県",null,null,null,null,"貯水槽清掃",null,null,null,null,null,null,null,null,null,220,null,null,null,null,null,"03",null,"04"]
["その他清掃",null,null,null,null,null,null,null,null,null,null,null,null,null,null,null,null,null,null,null,null,null,null,null,null,null,null,null,null,null,null,null,null,null,null,null,null,null,null,null,null,null,"04",null,"03"]
[]
[]
[]
[]
[]
[]
[]
[]
[]
[]
["自己保有機械器具〔宮城県内に保有するものに限る〕"]
["名　　称",null,null,null,null,null,"種　　　類",null,null,null,null,null,null,null,null,null,"能　　力",null,null,null,null,"数量",null,"名　　称",null,null,null,null,null,"種　　　類",null,null,null,null,null,null,null,null,null,"能　　力",null,null,null,null,"数量"]
["無線機",null,null,null,null,null,"業務用",null,null,null,null,null,null,null,null,null,"2km",null,null,null,null,20,null,"ポリッシャー",null,null,null,null,null,null,null,null,null,null,null,null,null,null,null,null,null,null,null,null,40]
["無線機",null,null,null,null,null,"トランシーバー",null,null,null,null,null,null,null,null,null,"０．５ｋｍ",null,null,null,null,10,null,"ダンプトラック類",null,null,null,null,null,"小型トラック、２ｔ",null,null,null,null,null,null,null,null,null,null,null,null,null,null,2]
["真空掃除機",null,null,null,null,null,"乾式",null,null,null,null,null,null,null,null,null,"２０ｋPa",null,null,null,null,20,null,"ダンプトラック類",null,null,null,null,null,"小型トラック、４ｔ",null,null,null,null,null,null,null,null,null,"ﾕﾆｯｸｸﾚｰﾝ付",null,null,null,null,1]
["真空掃除機",null,null,null,null,null,"乾式",null,null,null,null,null,null,null,null,null,null,null,null,null,null,20]

{"sheet":"2主要取扱品目（業務）名表入力ｼｰﾄ（兼出力ｼｰﾄ）","index":4,"n_rows":50,"n_cols":52,"rows_kept":50,"cut":false,"hidden":false,"merged":[[26,18,27,22],[28,25,29,26],[34,37,34,39],[30,18,31,22],[30,23,31,24],[30,27,31,40],[28,18,29,22],[16,23,17,24],[16,25,17,26],[20,25,21,26],[22,23,23,24],[22,25,23,26],[20,23,21,24],[24,23,25,24],[34,34,34,36],[26,25,27,26],[26,27,27,40],[16,0,17,1],[20,0,21,1],[16,2,17,3],[22,41,23,45],[28,27,29,40],[18,18,19,22],[14,18,15,22],[26,2,27,3],[18,4,19,17],[20,4,21,17],[22,4,23,17],[20,2,21,3],[22,18,23,22],[14,4,15,17],[24,18,25,22],[20,41,21,45],[28,41,29,45],[24,27,25,40],[24,41,25,45],[20,27,21,40],[26,23,27,24],[26,41,27,45],[22,27,23,40],[20,18,21,22],[7,0,7,1],[7,2,7,3],[7,4,7,17],[3,4,3,10],[3,11,3,17],[3,1,3,3],[6,0,6,45],[30,0,31,1],[28,0,29,1],[12,0,13,1],[12,2,13,3],[14,0,15,1],[30,2,31,3],[14,2,15,3],[30,4,31,17],[22,2,23,3],[24,4,25,17],[22,0,23,1],[24,2,25,3],[24,0,25,1],[28,4,29,17],[28,2,29,3],[26,0,27,1],[26,4,27,17],[5,11,5,17],[4,32,4,38],[2,32,2,38],[0,0,0,27],[3,0,5,0],[0,34,0,36],[0,37,0,39],[2,18,2,24],[5,1,5,3],[2,25,2,31],[3,18,3,24],[0,43,0,45],[3,32,3,38],[7,41,7,45],[7,25,7,26],[7,23,7,24],[7,27,7,40],[4,25,4,31],[5,25,5,31],[3,25,3,31],[5,32,5,38],[1,39,5,45],[5,18,5,24],[0,28,0,33],[10,0,11,1],[8,0,9,1],[8,2,9,3],[4,18,4,24],[5,4,5,10],[8,18,9,22],[8,4,9,17],[0,40,0,42],[1,32,1,38],[10,18,11,22],[10,2,11,3],[10,4,11,17],[10,23,11,24],[7,18,7,22],[1,18,1,24],[1,25,1,31],[1,4,1,10],[1,0,2,3],[2,4,2,10],[2,11,2,17],[1,11,1,17],[4,1,4,3],[4,4,4,10],[4,11,4,17],[8,23,9,24],[10,27,11,40],[10,25,11,26],[10,41,11,45],[8,25,9,26],[44,24,44,45],[43,24,43,45],[45,24,61,45],[8,41,9,45],[12,25,13,26],[12,27,13,40],[14,25,15,26],[14,41,15,45],[14,27,15,40],[8,27,9,40],[32,27,33,40],[32,23,33,24],[36,24,36,45],[34,43,34,45],[34,28,34,33],[30,25,31,26],[28,23,29,24],[30,41,31,45],[24,25,25,26],[63,40,63,45],[39,24,39,45],[40,24,40,45],[41,24,41,45],[42,24,42,45],[56,11,56,14],[49,15,49,23],[40,21,40,23],[42,7,42,20],[40,7,40,20],[39,7,39,20],[39,21,39,23],[53,11,53,14],[55,0,55,10],[44,0,44,6],[47,7,47,20],[52,15,52,23],[44,21,44,23],[45,21,45,23],[61,15,61,23],[55,15,55,23],[54,11,54,14],[55,11,55,14],[54,0,54,10],[38,24,38,45],[39,0,39,6],[42,0,42,6],[50,0,50,10],[47,0,47,6],[56,0,56,10],[51,0,51,10],[18,41,19,45],[12,41,13,45],[18,25,19,26],[12,23,13,24],[18,27,19,40],[18,23,19,24],[40,0,40,6],[41,0,41,6],[14,23,15,24],[12,18,13,22],[16,41,17,45],[16,27,17,40],[16,18,17,22],[12,4,13,17],[16,4,17,17],[18,0,19,1],[18,2,19,3],[38,21,38,23],[38,0,38,6],[41,7,41,20],[37,21,37,23],[41,21,41,23],[38,7,38,20],[57,0,57,10],[53,0,53,10],[43,0,43,6],[44,7,44,20],[57,11,57,14],[42,21,42,23],[43,21,43,23],[50,11,50,14],[51,15,51,23],[43,7,43,20],[56,15,56,23],[53,15,53,23],[50,15,50,23],[47,21,47,23],[54,15,54,23],[45,7,45,20],[46,7,46,20],[49,11,49,14],[36,0,36,23],[35,0,35,45],[37,24,37,45],[34,40,34,42],[37,7,37,20],[37,0,37,6],[32,41,33,45],[32,25,33,26],[34,0,34,27],[32,18,33,22],[32,0,33,1],[32,2,33,3],[32,4,33,17],[51,11,51,14],[58,11,58,14],[58,15,58,23],[45,0,45,6],[48,0,48,23],[49,0,49,10],[57,15,57,23],[52,11,52,14],[46,21,46,23],[52,0,52,10],[46,0,46,6],[60,15,60,23],[61,11,61,14],[59,11,59,14],[59,15,59,23],[60,0,60,10],[60,11,60,14],[59,0,59,10],[58,0,58,10],[61,0,61,10]]}
[{"$f":"'1入力ｼｰﾄ'!E$96&\" \"&'1入力ｼｰﾄ'!E$222","v":" "},null,null,null,null,null,null,null,null,null,null,null,null,null,null,null,null,null,null,null,null,null,null,null,null,null,null,null,null,null,null,null,null,null,{"$f":"IF('1入力ｼｰﾄ'!E$134=\"\",\"\",IF(LEFT('1入力ｼｰﾄ'!E$134,2)=\"04\",\"県内\",\"県外\"))","v":""},null,null,{"$f":"IF('1入力ｼｰﾄ'!B$293=\"\",\"\",LEFT('1入力ｼｰﾄ'!B$293,3))","v":""},null,null,{"$f":"IF('1入力ｼｰﾄ'!I$293=\"\",\"\",'1入力ｼｰﾄ'!I$293)","v":""},null,null,{"$f":"IF('1入力ｼｰﾄ'!E$101=\"\",\"\",(LEFT('1入力ｼｰﾄ'!E$101,2)))","v":""}]
["大分類",null,null,null,"第1希望",null,null,null,null,null,null,"第2希望",null,null,null,null,null,null,"第3希望",null,null,null,null,null,null,"第4希望",null,null,null,null,null,null,"第5希望"]
[null,null,null,null,{"$f":"IF(OR('1入力ｼｰﾄ'!B293=0,出力ｼｰﾄ1!AM46=\"error\"),\"\",'1入力ｼｰﾄ'!B293)","v":""},null,null,null,null,null,null,{"$f":"IF(OR('1入力ｼｰﾄ'!B295=0,出力ｼｰﾄ1!AM46=\"error\"),\"\",'1入力ｼｰﾄ'!B295)","v":""},null,null,null,null,null,null,{"$f":"IF(OR('1入力ｼｰﾄ'!B297=0,出力ｼｰﾄ1!AM46=\"error\"),\"\",'1入力ｼｰﾄ'!B297)","v":""},null,null,null,null,null,null,{"$f":"IF(OR('1入力ｼｰﾄ'!B299=0,出力ｼｰﾄ1!AM46=\"error\"),\"\",'1入力ｼｰﾄ'!B299)","v":""},null,null,null,null,null,null,{"$f":"IF(OR('1入力ｼｰﾄ'!B301=0,出力ｼｰﾄ1!AM46=\"error\"),\"\",'1入力ｼｰﾄ'!B301)","v":""}]
["小分類","第1希望",null,null,{"$f":"IF(OR('1入力ｼｰﾄ'!I293=0,出力ｼｰﾄ1!AM46=\"error\"),\"\",IF(ISERROR(VLOOKUP(LEFT('1入力ｼｰﾄ'!B293,3)&'1入力ｼｰﾄ'!I293,小分類リスト,2,FALSE)),\"\",VLOOKUP(LEFT('1入力ｼｰﾄ'!B293,3)&'1入力ｼｰﾄ'!I293,小分類リスト,2,FALSE)))","v":""},null,null,null,null,null,null,{"$f":"IF(OR('1入力ｼｰﾄ'!I295=0,出力ｼｰﾄ1!AM46=\"error\"),\"\",IF(ISERROR(VLOOKUP(LEFT('1入力ｼｰﾄ'!B295,3)&'1入力ｼｰﾄ'!I295,小分類リスト,2,FALSE)),\"\",VLOOKUP(LEFT('1入力ｼｰﾄ'!B295,3)&'1入力ｼｰﾄ'!I295,小分類リスト,2,FALSE)))","v":""},null,null,null,null,null,null,{"$f":"IF(OR('1入力ｼｰﾄ'!I297=0,出力ｼｰﾄ1!AM46=\"error\"),\"\",IF(ISERROR(VLOOKUP(LEFT('1入力ｼｰﾄ'!B297,3)&'1入力ｼｰﾄ'!I297,小分類リスト,2,FALSE)),\"\",VLOOKUP(LEFT('1入力ｼｰﾄ'!B297,3)&'1入力ｼｰﾄ'!I297,小分類リスト,2,FALSE)))","v":""},null,null,null,null,null,null,{"$f":"IF(OR('1入力ｼｰﾄ'!I299=0,出力ｼｰﾄ1!AM46=\"error\"),\"\",IF(ISERROR(VLOOKUP(LEFT('1入力ｼｰﾄ'!B299,3)&'1入力ｼｰﾄ'!I299,小分類リスト,2,FALSE)),\"\",VLOOKUP(LEFT('1入力ｼｰﾄ'!B299,3)&'1入力ｼｰﾄ'!I299,小分類リスト,2,FALSE)))","v":""},null,null,null,null,null,null,{"$f":"IF(OR('1入力ｼｰﾄ'!I301=0,出力ｼｰﾄ1!AM46=\"error\"),\"\",IF(ISERROR(VLOOKUP(LEFT('1入力ｼｰﾄ'!B301,3)&'1入力ｼｰﾄ'!I301,小分類リスト,2,FALSE)),\"\",VLOOKUP(LEFT('1入力ｼｰﾄ'!B301,3)&'1入力ｼｰﾄ'!I301,小分類リスト,2,FALSE)))","v":""}]
[null,"第2希望",null,null,{"$f":"IF(OR('1入力ｼｰﾄ'!S293=0,出力ｼｰﾄ1!AM46=\"error\"),\"\",IF(ISERROR(VLOOKUP(LEFT('1入力ｼｰﾄ'!B293,3)&'1入力ｼｰﾄ'!S293,小分類リスト,2,FALSE)),\"\",VLOOKUP(LEFT('1入力ｼｰﾄ'!B293,3)&'1入力ｼｰﾄ'!S293,小分類リスト,2,FALSE)))","v":""},null,null,null,null,null,null,{"$f":"IF(OR('1入力ｼｰﾄ'!S295=0,出力ｼｰﾄ1!AM46=\"error\"),\"\",IF(ISERROR(VLOOKUP(LEFT('1入力ｼｰﾄ'!B295,3)&'1入力ｼｰﾄ'!S295,小分類リスト,2,FALSE)),\"\",VLOOKUP(LEFT('1入力ｼｰﾄ'!B295,3)&'1入力ｼｰﾄ'!S295,小分類リスト,2,FALSE)))","v":""},null,null,null,null,null,null,{"$f":"IF(OR('1入力ｼｰﾄ'!S297=0,出力ｼｰﾄ1!AM46=\"error\"),\"\",IF(ISERROR(VLOOKUP(LEFT('1入力ｼｰﾄ'!B297,3)&'1入力ｼｰﾄ'!S297,小分類リスト,2,FALSE)),\"\",VLOOKUP(LEFT('1入力ｼｰﾄ'!B297,3)&'1入力ｼｰﾄ'!S297,小分類リスト,2,FALSE)))","v":""},null,null,null,null,null,null,{"$f":"IF(OR('1入力ｼｰﾄ'!S299=0,出力ｼｰﾄ1!AM46=\"error\"),\"\",IF(ISERROR(VLOOKUP(LEFT('1入力ｼｰﾄ'!B299,3)&'1入力ｼｰﾄ'!S299,小分類リスト,2,FALSE)),\"\",VLOOKUP(LEFT('1入力ｼｰﾄ'!B299,3)&'1入力ｼｰﾄ'!S299,小分類リスト,2,FALSE)))","v":""},null,null,null,null,null,null,{"$f":"IF(OR('1入力ｼｰﾄ'!S301=0,出力ｼｰﾄ1!AM46=\"error\"),\"\",IF(ISERROR(VLOOKUP(LEFT('1入力ｼｰﾄ'!B301,3)&'1入力ｼｰﾄ'!S301,小分類リスト,2,FALSE)),\"\",VLOOKUP(LEFT('1入力ｼｰﾄ'!B301,3)&'1入力ｼｰﾄ'!S301,小分類リスト,2,FALSE)))","v":""}]
[null,"第3希望",null,null,{"$f":"IF(OR('1入力ｼｰﾄ'!AC293=0,出力ｼｰﾄ1!AM46=\"error\"),\"\",IF(ISERROR(VLOOKUP(LEFT('1入力ｼｰﾄ'!B293,3)&'1入力ｼｰﾄ'!AC293,小分類リスト,2,FALSE)),\"\",VLOOKUP(LEFT('1入力ｼｰﾄ'!B293,3)&'1入力ｼｰﾄ'!AC293,小分類リスト,2,FALSE)))","v":""},null,null,null,null,null,null,{"$f":"IF(OR('1入力ｼｰﾄ'!AC295=0,出力ｼｰﾄ1!AM46=\"error\"),\"\",IF(ISERROR(VLOOKUP(LEFT('1入力ｼｰﾄ'!B295,3)&'1入力ｼｰﾄ'!AC295,小分類リスト,2,FALSE)),\"\",VLOOKUP(LEFT('1入力ｼｰﾄ'!B295,3)&'1入力ｼｰﾄ'!AC295,小分類リスト,2,FALSE)))","v":""},null,null,null,null,null,null,{"$f":"IF(OR('1入力ｼｰﾄ'!AC297=0,出力ｼｰﾄ1!AM46=\"error\"),\"\",IF(ISERROR(VLOOKUP(LEFT('1入力ｼｰﾄ'!B297,3)&'1入力ｼｰﾄ'!AC297,小分類リスト,2,FALSE)),\"\",VLOOKUP(LEFT('1入力ｼｰﾄ'!B297,3)&'1入力ｼｰﾄ'!AC297,小分類リスト,2,FALSE)))","v":""},null,null,null,null,null,null,{"$f":"IF(OR('1入力ｼｰﾄ'!AC299=0,出力ｼｰﾄ1!AM46=\"error\"),\"\",IF(ISERROR(VLOOKUP(LEFT('1入力ｼｰﾄ'!B299,3)&'1入力ｼｰﾄ'!AC299,小分類リスト,2,FALSE)),\"\",VLOOKUP(LEFT('1入力ｼｰﾄ'!B299,3)&'1入力ｼｰﾄ'!AC299,小分類リスト,2,FALSE)))","v":""},null,null,null,null,null,null,{"$f":"IF(OR('1入力ｼｰﾄ'!AC301=0,出力ｼｰﾄ1!AM46=\"error\"),\"\",IF(ISERROR(VLOOKUP(LEFT('1入力ｼｰﾄ'!B301,3)&'1入力ｼｰﾄ'!AC301,小分類リスト,2,FALSE)),\"\",VLOOKUP(LEFT('1入力ｼｰﾄ'!B301,3)&'1入力ｼｰﾄ'!AC301,小分類リスト,2,FALSE)))","v":""}]
[]
["大分類",null,"小分類",null,"主要取扱品目または業務名",null,null,null,null,null,null,null,null,null,null,null,null,null,"メーカー名",null,null,null,null,"大分類",null,"小分類",null,"主要取扱品目または業務名",null,null,null,null,null,null,null,null,null,null,null,null,null,"メーカー名"]
[null,null,null,null,null,null,null,null,null,null,null,null,null,null,null,null,null,null,null,null,null,null,null,null,null,null,null,null,null,null,null,null,null,null,null,null,null,null,null,null,null,null,null,null,null,null,null,null,null,1,{"$f":"A9&C9","v":""},{"$f":"IF(E9=0,\"\",E9)","v":""}]
[null,null,null,null,null,null,null,null,null,null,null,null,null,null,null,null,null,null,null,null,null,null,null,null,null,null,null,null,null,null,null,null,null,null,null,null,null,null,null,null,null,null,null,null,null,null,null,null,null,2,{"$f":"A11&C11","v":""},{"$f":"IF(E11=0,\"\",E11)","v":""}]
[null,null,null,null,null,null,null,null,null,null,null,null,null,null,null,null,null,null,null,null,null,null,null,null,null,null,null,null,null,null,null,null,null,null,null,null,null,null,null,null,null,null,null,null,null,null,null,null,null,3,{"$f":"A13&C13","v":""},{"$f":"IF(E13=0,\"\",E13)","v":""}]
[null,null,null,null,null,null,null,null,null,null,null,null,null,null,null,null,null,null,null,null,null,null,null,null,null,null,null,null,null,null,null,null,null,null,null,null,null,null,null,null,null,null,null,null,null,null,null,null,null,4,{"$f":"A15&C15","v":""},{"$f":"IF(E15=0,\"\",E15)","v":""}]
[null,null,null,null,null,null,null,null,null,null,null,null,null,null,null,null,null,null,null,null,null,null,null,null,null,null,null,null,null,null,null,null,null,null,null,null,null,null,null,null,null,null,null,null,null,null,null,null,null,5,{"$f":"A17&C17","v":""},{"$f":"IF(E17=0,\"\",E17)","v":""}]
[null,null,null,null,null,null,null,null,null,null,null,null,null,null,null,null,null,null,null,null,null,null,null,null,null,null,null,null,null,null,null,null,null,null,null,null,null,null,null,null,null,null,null,null,null,null,null,null,null,6,{"$f":"A19&C19","v":""},{"$f":"IF(E19=0,\"\",E19)","v":""}]
[null,null,null,null,null,null,null,null,null,null,null,null,null,null,null,null,null,null,null,null,null,null,null,null,null,null,null,null,null,null,null,null,null,null,null,null,null,null,null,null,null,null,null,null,null,null,null,null,null,7,{"$f":"A21&C21","v":""},{"$f":"IF(E21=0,\"\",E21)","v":""}]
[null,null,null,null,null,null,null,null,null,null,null,null,null,null,null,null,null,null,null,null,null,null,null,null,null,null,null,null,null,null,null,null,null,null,null,null,null,null,null,null,null,null,null,null,null,null,null,null,null,8,{"$f":"A23&C23","v":""},{"$f":"IF(E23=0,\"\",E23)","v":""}]
[null,null,null,null,null,null,null,null,null,null,null,null,null,null,null,null,null,null,null,null,null,null,null,null,null,null,null,null,null,null,null,null,null,null,null,null,null,null,null,null,null,null,null,null,null,null,null,null,null,9,{"$f":"A25&C25","v":""},{"$f":"IF(E25=0,\"\",E25)","v":""}]
[null,null,null,null,null,null,null,null,null,null,null,null,null,null,null,null,null,null,null,null,null,null,null,null,null,null,null,null,null,null,null,null,null,null,null,null,null,null,null,null,null,null,null,null,null,null,null,null,null,10,{"$f":"A27&C27","v":""},{"$f":"IF(E27=0,\"\",E27)","v":""}]
[null,null,null,null,null,null,null,null,null,null,null,null,null,null,null,null,null,null,null,null,null,null,null,null,null,null,null,null,null,null,null,null,null,null,null,null,null,null,null,null,null,null,null,null,null,null,null,null,null,11,{"$f":"A29&C29","v":""},{"$f":"IF(E29=0,\"\",E29)","v":""}]
[null,null,null,null,null,null,null,null,null,null,null,null,null,null,null,null,null,null,null,null,null,null,null,null,null,null,null,null,null,null,null,null,null,null,null,null,null,null,null,null,null,null,null,null,null,null,null,null,null,12,{"$f":"A31&C31","v":""},{"$f":"IF(E31=0,\"\",E31)","v":""}]
[null,null,null,null,null,null,null,null,null,null,null,null,null,null,null,null,null,null,null,null,null,null,null,null,null,null,null,null,null,null,null,null,null,null,null,null,null,null,null,null,null,null,null,null,null,null,null,null,null,13,{"$f":"A33&C33","v":""},{"$f":"IF(E33=0,\"\",E33)","v":""}]
[null,null,null,null,null,null,null,null,null,null,null,null,null,null,null,null,null,null,null,null,null,null,null,null,null,null,null,null,null,null,null,null,null,null,null,null,null,null,null,null,null,null,null,null,null,null,null,null,null,14,{"$f":"X9&Z9","v":""},{"$f":"IF(AB9=0,\"\",AB9)","v":""}]
[null,null,null,null,null,null,null,null,null,null,null,null,null,null,null,null,null,null,null,null,null,null,null,null,null,null,null,null,null,null,null,null,null,null,null,null,null,null,null,null,null,null,null,null,null,null,null,null,null,15,{"$f":"X11&Z11","v":""},{"$f":"IF(AB11=0,\"\",AB11)","v":""}]
[null,null,null,null,null,null,null,null,null,null,null,null,null,null,null,null,null,null,null,null,null,null,null,null,null,null,null,null,null,null,null,null,null,null,null,null,null,null,null,null,null,null,null,null,null,null,null,null,null,16,{"$f":"X13&Z13","v":""},{"$f":"IF(AB13=0,\"\",AB13)","v":""}]
[null,null,null,null,null,null,null,null,null,null,null,null,null,null,null,null,null,null,null,null,null,null,null,null,null,null,null,null,null,null,null,null,null,null,null,null,null,null,null,null,null,null,null,null,null,null,null,null,null,17,{"$f":"X15&Z15","v":""},{"$f":"IF(AB15=0,\"\",AB15)","v":""}]
[null,null,null,null,null,null,null,null,null,null,null,null,null,null,null,null,null,null,null,null,null,null,null,null,null,null,null,null,null,null,null,null,null,null,null,null,null,null,null,null,null,null,null,null,null,null,null,null,null,18,{"$f":"X17&Z17","v":""},{"$f":"IF(AB17=0,\"\",AB17)","v":""}]
[null,null,null,null,null,null,null,null,null,null,null,null,null,null,null,null,null,null,null,null,null,null,null,null,null,null,null,null,null,null,null,null,null,null,null,null,null,null,null,null,null,null,null,null,null,null,null,null,null,19,{"$f":"X19&Z19","v":""},{"$f":"IF(AB19=0,\"\",AB19)","v":""}]
[null,null,null,null,null,null,null,null,null,null,null,null,null,null,null,null,null,null,null,null,null,null,null,null,null,null,null,null,null,null,null,null,null,null,null,null,null,null,null,null,null,null,null,null,null,null,null,null,null,20,{"$f":"X21&Z21","v":""},{"$f":"IF(AB21=0,\"\",AB21)","v":""}]
[null,null,null,null,null,null,null,null,null,null,null,null,null,null,null,null,null,null,null,null,null,null,null,null,null,null,null,null,null,null,null,null,null,null,null,null,null,null,null,null,null,null,null,null,null,null,null,null,null,21,{"$f":"X23&Z23","v":""},{"$f":"IF(AB23=0,\"\",AB23)","v":""}]
[null,null,null,null,null,null,null,null,null,null,null,null,null,null,null,null,null,null,null,null,null,null,null,null,null,null,null,null,null,null,null,null,null,null,null,null,null,null,null,null,null,null,null,null,null,null,null,null,null,22,{"$f":"X25&Z25","v":""},{"$f":"IF(AB25=0,\"\",AB25)","v":""}]
[null,null,null,null,null,null,null,null,null,null,null,null,null,null,null,null,null,null,null,null,null,null,null,null,null,null,null,null,null,null,null,null,null,null,null,null,null,null,null,null,null,null,null,null,null,null,null,null,null,23,{"$f":"X27&Z27","v":""},{"$f":"IF(AB27=0,\"\",AB27)","v":""}]
[null,null,null,null,null,null,null,null,null,null,null,null,null,null,null,null,null,null,null,null,null,null,null,null,null,null,null,null,null,null,null,null,null,null,null,null,null,null,null,null,null,null,null,null,null,null,null,null,null,24,{"$f":"X29&Z29","v":""},{"$f":"IF(AB29=0,\"\",AB29)","v":""}]
[null,null,null,null,null,null,null,null,null,null,null,null,null,null,null,null,null,null,null,null,null,null,null,null,null,null,null,null,null,null,null,null,null,null,null,null,null,null,null,null,null,null,null,null,null,null,null,null,null,25,{"$f":"X31&Z31","v":""},{"$f":"IF(AB31=0,\"\",AB31)","v":""}]
[null,null,null,null,null,null,null,null,null,null,null,null,null,null,null,null,null,null,null,null,null,null,null,null,null,null,null,null,null,null,null,null,null,null,null,null,null,null,null,null,null,null,null,null,null,null,null,null,null,26,{"$f":"X33&Z33","v":""},{"$f":"IF(AB33=0,\"\",AB33)","v":""}]
[{"$f":"'1入力ｼｰﾄ'!E$96&\" \"&'1入力ｼｰﾄ'!E$222","v":" "},null,null,null,null,null,null,null,null,null,null,null,null,null,null,null,null,null,null,null,null,null,null,null,null,null,null,null,null,null,null,null,null,null,{"$f":"IF('1入力ｼｰﾄ'!E$134=\"\",\"\",IF(LEFT('1入力ｼｰﾄ'!E$134,2)=\"04\",\"県内\",\"県外\"))","v":""},null,null,{"$f":"IF('1入力ｼｰﾄ'!B$293=\"\",\"\",LEFT('1入力ｼｰﾄ'!B$293,3))","v":""},null,null,{"$f":"IF('1入力ｼｰﾄ'!I$293=\"\",\"\",'1入力ｼｰﾄ'!I$293)","v":""},null,null,{"$f":"IF('1入力ｼｰﾄ'!E$101=\"\",\"\",(LEFT('1入力ｼｰﾄ'!E$101,2)))","v":""}]
[null,null,null,null,null,null,null,null,null,null,null,null,null,null,null,null,null,null,null,null,null,null,null,null,null,null,null,null,null,null,null,null,null,null,null,null,null,null,null,null,null,null,null,null,null,null,null,null,null,null,{"$f":"IF(出力ｼｰﾄ1!AM46=\"error\",\"\",IF(ISERROR(VLOOKUP(LEFT(E3,3)&LEFT(E4,3),主要品目リスト,2,FALSE)),\"\",(VLOOKUP(LEFT(E3,3)&LEFT(E4,3),主要品目リスト,2,FALSE))))","v":""}]
["代理店・特約店・仕入れ先関係等",null,null,null,null,null,null,null,null,null,null,null,null,null,null,null,null,null,null,null,null,null,null,null,"そ　　　の　　　他"]
["相手方業者名",null,null,null,null,null,null,"主　　な　　品　　名",null,null,null,null,null,null,null,null,null,null,null,null,null,"契約内容",null,null,"※大分類103｢印刷･製本」を取引希望営業種目として申請する方は、所有する印刷、",null,null,null,null,null,null,null,null,null,null,null,null,null,null,null,null,null,null,null,null,null,null,null,null,null,{"$f":"IF(出力ｼｰﾄ1!AM46=\"error\",\"\",IF(ISERROR(VLOOKUP(LEFT(L3,3)&LEFT(L4,3),主要品目リスト,2,FALSE)),\"\",VLOOKUP(LEFT(L3,3)&LEFT(L4,3),主要品目リスト,2,FALSE)))","v":""}]
[null,null,null,null,null,null,null,null,null,null,null,null,null,null,null,null,null,null,null,null,null,null,null,null,"　製本用の機械の種類と台数を記載してください。"]
[null,null,null,null,null,null,null,null,null,null,null,null,null,null,null,null,null,null,null,null,null,null,null,null,"※大分類111「燃料」を取引希望営業種目として申請する方で、仙台市内及びその"]
[null,null,null,null,null,null,null,null,null,null,null,null,null,null,null,null,null,null,null,null,null,null,null,null,"　近辺にガソリンスタンドを有している方は、そのすべての名称、所在地の住所を記"]
[null,null,null,null,null,null,null,null,null,null,null,null,null,null,null,null,null,null,null,null,null,null,null,null,"　載してください。"]
[null,null,null,null,null,null,null,null,null,null,null,null,null,null,null,null,null,null,null,null,null,null,null,null,"※大分類116「サービス業」の小分類004「運送」を取引希望営業種目として申請する"]
[null,null,null,null,null,null,null,null,null,null,null,null,null,null,null,null,null,null,null,null,null,null,null,null,"　方は、所有する運送用車両の種類と台数を記載してください。"]
[null,null,null,null,null,null,null,null,null,null,null,null,null,null,null,null,null,null,null,null,null,null,null,null,"※書ききれない場合は、別紙を添付していただいてもけっこうです。"]
[]
[]
[]
["許 可 ・ 認 可 ・ 登 録　等　（各許認可登録証等の写しを添付すること）"]
["許 可 等 の 名 称",null,null,null,null,null,null,null,null,null,null,"許可等年月日",null,null,null,"許 可 等 番 号"]

{"sheet":"3清掃・警備業務経歴入力ｼｰﾄ（兼出力ｼｰﾄ）","index":5,"n_rows":40,"n_cols":45,"rows_kept":40,"cut":false,"hidden":false,"merged":[[39,37,39,40],[39,41,39,43],[35,23,35,28],[35,29,35,38],[35,0,35,5],[22,11,23,20],[22,26,23,35],[26,26,27,35],[24,26,25,35],[24,3,25,8],[22,21,23,25],[23,0,23,2],[24,21,25,25],[26,21,27,25],[27,0,27,2],[22,3,23,8],[26,3,27,8],[28,26,29,35],[36,29,36,38],[31,0,31,2],[34,0,34,5],[36,0,36,5],[36,6,36,15],[36,16,36,20],[29,0,29,2],[26,9,27,10],[28,0,28,2],[22,0,22,2],[30,0,30,2],[30,3,31,8],[25,0,25,2],[24,11,25,20],[21,0,21,2],[30,11,31,20],[26,11,27,20],[24,0,24,2],[26,0,26,2],[28,21,29,25],[28,11,29,20],[18,3,19,8],[20,9,21,10],[20,3,21,8],[18,11,19,20],[30,21,31,25],[22,9,23,10],[28,3,29,8],[18,9,19,10],[24,9,25,10],[10,36,11,41],[20,26,21,35],[18,0,18,2],[16,0,16,2],[16,3,17,8],[15,0,15,2],[16,26,17,35],[20,0,20,2],[16,9,17,10],[19,0,19,2],[18,21,19,25],[20,21,21,25],[11,0,11,2],[20,11,21,20],[13,0,13,2],[18,26,19,35],[14,26,15,35],[14,21,15,25],[14,9,15,10],[14,3,15,8],[16,21,17,25],[14,11,15,20],[16,11,17,20],[17,0,17,2],[2,4,2,10],[8,0,8,2],[3,39,3,45],[8,42,8,45],[9,42,9,45],[5,1,5,3],[3,18,3,24],[2,18,2,24],[3,25,3,31],[2,39,2,45],[1,0,2,3],[3,1,3,3],[4,1,4,3],[3,4,3,10],[6,0,7,11],[2,32,2,38],[8,36,9,41],[4,11,4,17],[9,0,9,2],[8,3,9,8],[8,9,9,10],[8,11,9,20],[8,26,9,35],[3,11,3,17],[11,42,11,43],[12,36,13,41],[5,32,5,38],[10,44,10,45],[4,39,4,45],[12,0,12,2],[10,11,11,20],[10,21,11,25],[4,32,4,38],[8,21,9,25],[5,25,5,31],[5,4,5,10],[4,4,4,10],[10,26,11,35],[10,0,10,2],[10,3,11,8],[12,21,13,25],[12,11,13,20],[12,3,13,8],[10,9,11,10],[12,9,13,10],[4,25,4,31],[3,0,5,0],[11,44,11,45],[0,28,0,33],[2,25,2,31],[3,32,3,38],[1,18,1,24],[33,0,33,5],[4,18,4,24],[2,11,2,17],[5,11,5,17],[6,12,7,45],[5,18,5,24],[0,43,0,45],[1,25,1,31],[1,32,1,38],[1,39,1,45],[0,0,0,27],[0,37,0,39],[0,40,0,42],[1,4,1,10],[1,11,1,17],[0,34,0,36],[13,44,13,45],[10,42,10,43],[12,26,13,35],[5,39,5,45],[14,0,14,2],[30,44,30,45],[29,44,29,45],[35,6,35,15],[35,16,35,20],[33,39,33,43],[34,44,34,45],[28,36,29,41],[33,6,33,15],[30,9,31,10],[28,9,29,10],[33,16,33,20],[34,16,34,20],[35,21,35,22],[34,21,34,22],[33,21,33,22],[34,6,34,15],[30,26,31,35],[33,29,33,38],[34,39,34,43],[33,23,33,28],[34,23,34,28],[33,44,33,45],[32,0,32,45],[35,44,35,45],[36,21,36,22],[38,0,38,6],[35,39,35,43],[36,39,36,43],[37,29,37,38],[34,29,34,38],[37,23,37,28],[37,21,37,22],[37,0,37,5],[37,6,37,15],[37,16,37,20],[37,39,37,43],[36,23,36,28],[31,44,31,45],[30,36,31,41],[31,42,31,43],[30,42,30,43],[18,42,18,43],[17,44,17,45],[20,36,21,41],[20,42,20,43],[37,44,37,45],[36,44,36,45],[27,42,27,43],[18,36,19,41],[28,42,28,43],[24,42,24,43],[25,42,25,43],[29,42,29,43],[28,44,28,45],[27,44,27,45],[26,42,26,43],[22,36,23,41],[23,44,23,45],[26,36,27,41],[24,36,25,41],[24,44,24,45],[22,44,22,45],[25,44,25,45],[26,44,26,45],[22,42,22,43],[23,42,23,43],[14,36,15,41],[12,44,12,45],[21,42,21,43],[17,42,17,43],[19,44,19,45],[20,44,20,45],[19,42,19,43],[14,44,14,45],[15,44,15,45],[16,44,16,45],[16,36,17,41],[14,42,14,43],[16,42,16,43],[21,44,21,45],[15,42,15,43],[12,42,12,43],[18,44,18,45],[13,42,13,43]]}
[{"$f":"'1入力ｼｰﾄ'!E96&\" \"&'1入力ｼｰﾄ'!E222","v":" "},null,null,null,null,null,null,null,null,null,null,null,null,null,null,null,null,null,null,null,null,null,null,null,null,null,null,null,null,null,null,null,null,null,{"$f":"IF('1入力ｼｰﾄ'!E134=\"\",\"\",IF(LEFT('1入力ｼｰﾄ'!E134,2)=\"04\",\"県内\",\"県外\"))","v":""},null,null,{"$f":"IF('1入力ｼｰﾄ'!B293=\"\",\"\",LEFT('1入力ｼｰﾄ'!B293,3))","v":""},null,null,{"$f":"IF('1入力ｼｰﾄ'!I293=\"\",\"\",'1入力ｼｰﾄ'!I293)","v":""},null,null,{"$f":"IF('1入力ｼｰﾄ'!E101=\"\",\"\",(LEFT('1入力ｼｰﾄ'!E101,2)))","v":""}]
["大分類",null,null,null,"第1希望",null,null,null,null,null,null,"第2希望",null,null,null,null,null,null,"第3希望",null,null,null,null,null,null,"第4希望",null,null,null,null,null,null,"第5希望"]
[null,null,null,null,{"$f":"IF(OR('1入力ｼｰﾄ'!B293=0,出力ｼｰﾄ1!AM46=\"error\"),\"\",'1入力ｼｰﾄ'!B293)","v":""},null,null,null,null,null,null,{"$f":"IF(OR('1入力ｼｰﾄ'!B295=0,出力ｼｰﾄ1!AM46=\"error\"),\"\",'1入力ｼｰﾄ'!B295)","v":""},null,null,null,null,null,null,{"$f":"IF(OR('1入力ｼｰﾄ'!B297=0,出力ｼｰﾄ1!AM46=\"error\"),\"\",'1入力ｼｰﾄ'!B297)","v":""},null,null,null,null,null,null,{"$f":"IF(OR('1入力ｼｰﾄ'!B299=0,出力ｼｰﾄ1!AM46=\"error\"),\"\",'1入力ｼｰﾄ'!B299)","v":""},null,null,null,null,null,null,{"$f":"IF(OR('1入力ｼｰﾄ'!B301=0,出力ｼｰﾄ1!AM46=\"error\"),\"\",'1入力ｼｰﾄ'!B301)","v":""}]
["小分類","第1希望",null,null,{"$f":"IF(OR('1入力ｼｰﾄ'!I293=0,出力ｼｰﾄ1!AM46=\"error\"),\"\",IF(ISERROR(VLOOKUP(LEFT('1入力ｼｰﾄ'!B293,3)&'1入力ｼｰﾄ'!I293,小分類リスト,2,FALSE)),\"\",VLOOKUP(LEFT('1入力ｼｰﾄ'!B293,3)&'1入力ｼｰﾄ'!I293,小分類リスト,2,FALSE)))","v":""},null,null,null,null,null,null,{"$f":"IF(OR('1入力ｼｰﾄ'!I295=0,出力ｼｰﾄ1!AM46=\"error\"),\"\",IF(ISERROR(VLOOKUP(LEFT('1入力ｼｰﾄ'!B295,3)&'1入力ｼｰﾄ'!I295,小分類リスト,2,FALSE)),\"\",VLOOKUP(LEFT('1入力ｼｰﾄ'!B295,3)&'1入力ｼｰﾄ'!I295,小分類リスト,2,FALSE)))","v":""},null,null,null,null,null,null,{"$f":"IF(OR('1入力ｼｰﾄ'!I297=0,出力ｼｰﾄ1!AM46=\"error\"),\"\",IF(ISERROR(VLOOKUP(LEFT('1入力ｼｰﾄ'!B297,3)&'1入力ｼｰﾄ'!I297,小分類リスト,2,FALSE)),\"\",VLOOKUP(LEFT('1入力ｼｰﾄ'!B297,3)&'1入力ｼｰﾄ'!I297,小分類リスト,2,FALSE)))","v":""},null,null,null,null,null,null,{"$f":"IF(OR('1入力ｼｰﾄ'!I299=0,出力ｼｰﾄ1!AM46=\"error\"),\"\",IF(ISERROR(VLOOKUP(LEFT('1入力ｼｰﾄ'!B299,3)&'1入力ｼｰﾄ'!I299,小分類リスト,2,FALSE)),\"\",VLOOKUP(LEFT('1入力ｼｰﾄ'!B299,3)&'1入力ｼｰﾄ'!I299,小分類リスト,2,FALSE)))","v":""},null,null,null,null,null,null,{"$f":"IF(OR('1入力ｼｰﾄ'!I301=0,出力ｼｰﾄ1!AM46=\"error\"),\"\",IF(ISERROR(VLOOKUP(LEFT('1入力ｼｰﾄ'!B301,3)&'1入力ｼｰﾄ'!I301,小分類リスト,2,FALSE)),\"\",VLOOKUP(LEFT('1入力ｼｰﾄ'!B301,3)&'1入力ｼｰﾄ'!I301,小分類リスト,2,FALSE)))","v":""}]
[null,"第2希望",null,null,{"$f":"IF(OR('1入力ｼｰﾄ'!S293=0,出力ｼｰﾄ1!AM46=\"error\"),\"\",IF(ISERROR(VLOOKUP(LEFT('1入力ｼｰﾄ'!B293,3)&'1入力ｼｰﾄ'!S293,小分類リスト,2,FALSE)),\"\",VLOOKUP(LEFT('1入力ｼｰﾄ'!B293,3)&'1入力ｼｰﾄ'!S293,小分類リスト,2,FALSE)))","v":""},null,null,null,null,null,null,{"$f":"IF(OR('1入力ｼｰﾄ'!S295=0,出力ｼｰﾄ1!AM46=\"error\"),\"\",IF(ISERROR(VLOOKUP(LEFT('1入力ｼｰﾄ'!B295,3)&'1入力ｼｰﾄ'!S295,小分類リスト,2,FALSE)),\"\",VLOOKUP(LEFT('1入力ｼｰﾄ'!B295,3)&'1入力ｼｰﾄ'!S295,小分類リスト,2,FALSE)))","v":""},null,null,null,null,null,null,{"$f":"IF(OR('1入力ｼｰﾄ'!S297=0,出力ｼｰﾄ1!AM46=\"error\"),\"\",IF(ISERROR(VLOOKUP(LEFT('1入力ｼｰﾄ'!B297,3)&'1入力ｼｰﾄ'!S297,小分類リスト,2,FALSE)),\"\",VLOOKUP(LEFT('1入力ｼｰﾄ'!B297,3)&'1入力ｼｰﾄ'!S297,小分類リスト,2,FALSE)))","v":""},null,null,null,null,null,null,{"$f":"IF(OR('1入力ｼｰﾄ'!S299=0,出力ｼｰﾄ1!AM46=\"error\"),\"\",IF(ISERROR(VLOOKUP(LEFT('1入力ｼｰﾄ'!B299,3)&'1入力ｼｰﾄ'!S299,小分類リスト,2,FALSE)),\"\",VLOOKUP(LEFT('1入力ｼｰﾄ'!B299,3)&'1入力ｼｰﾄ'!S299,小分類リスト,2,FALSE)))","v":""},null,null,null,null,null,null,{"$f":"IF(OR('1入力ｼｰﾄ'!S301=0,出力ｼｰﾄ1!AM46=\"error\"),\"\",IF(ISERROR(VLOOKUP(LEFT('1入力ｼｰﾄ'!B301,3)&'1入力ｼｰﾄ'!S301,小分類リスト,2,FALSE)),\"\",VLOOKUP(LEFT('1入力ｼｰﾄ'!B301,3)&'1入力ｼｰﾄ'!S301,小分類リスト,2,FALSE)))","v":""}]
[null,"第3希望",null,null,{"$f":"IF(OR('1入力ｼｰﾄ'!AC293=0,出力ｼｰﾄ1!AM46=\"error\"),\"\",IF(ISERROR(VLOOKUP(LEFT('1入力ｼｰﾄ'!B293,3)&'1入力ｼｰﾄ'!AC293,小分類リスト,2,FALSE)),\"\",VLOOKUP(LEFT('1入力ｼｰﾄ'!B293,3)&'1入力ｼｰﾄ'!AC293,小分類リスト,2,FALSE)))","v":""},null,null,null,null,null,null,{"$f":"IF(OR('1入力ｼｰﾄ'!AC295=0,出力ｼｰﾄ1!AM46=\"error\"),\"\",IF(ISERROR(VLOOKUP(LEFT('1入力ｼｰﾄ'!B295,3)&'1入力ｼｰﾄ'!AC295,小分類リスト,2,FALSE)),\"\",VLOOKUP(LEFT('1入力ｼｰﾄ'!B295,3)&'1入力ｼｰﾄ'!AC295,小分類リスト,2,FALSE)))","v":""},null,null,null,null,null,null,{"$f":"IF(OR('1入力ｼｰﾄ'!AC297=0,出力ｼｰﾄ1!AM46=\"error\"),\"\",IF(ISERROR(VLOOKUP(LEFT('1入力ｼｰﾄ'!B297,3)&'1入力ｼｰﾄ'!AC297,小分類リスト,2,FALSE)),\"\",VLOOKUP(LEFT('1入力ｼｰﾄ'!B297,3)&'1入力ｼｰﾄ'!AC297,小分類リスト,2,FALSE)))","v":""},null,null,null,null,null,null,{"$f":"IF(OR('1入力ｼｰﾄ'!AC299=0,出力ｼｰﾄ1!AM46=\"error\"),\"\",IF(ISERROR(VLOOKUP(LEFT('1入力ｼｰﾄ'!B299,3)&'1入力ｼｰﾄ'!AC299,小分類リスト,2,FALSE)),\"\",VLOOKUP(LEFT('1入力ｼｰﾄ'!B299,3)&'1入力ｼｰﾄ'!AC299,小分類リスト,2,FALSE)))","v":""},null,null,null,null,null,null,{"$f":"IF(OR('1入力ｼｰﾄ'!AC301=0,出力ｼｰﾄ1!AM46=\"error\"),\"\",IF(ISERROR(VLOOKUP(LEFT('1入力ｼｰﾄ'!B301,3)&'1入力ｼｰﾄ'!AC301,小分類リスト,2,FALSE)),\"\",VLOOKUP(LEFT('1入力ｼｰﾄ'!B301,3)&'1入力ｼｰﾄ'!AC301,小分類リスト,2,FALSE)))","v":""}]
["清　掃　・　警　備　業　務　経　歴",null,null,null,null,null,null,null,null,null,null,null,"申請日以前2ヵ年程度の期間に完了した官公庁（独立行政法人を含む）・民間における主な清掃・警備業務経歴を記載してください。宮城県内・近接県内官公庁発注の元請業務を中心に記載してください。"]
[]
["大分類",null,null,"発　注　者",null,null,null,null,null,"元請\n下請",null,"業　　務　　名",null,null,null,null,null,null,null,null,null,"履行場所\n(都道府県名)",null,null,null,null,"業　務　概　要",null,null,null,null,null,null,null,null,null,"請負金額(千円)",null,null,null,null,null,"着手年月"]
["小分類",null,null,null,null,null,null,null,null,null,null,null,null,null,null,null,null,null,null,null,null,null,null,null,null,null,null,null,null,null,null,null,null,null,null,null,null,null,null,null,null,null,"完了年月"]
[]
[]
[]
[]
[]
[]
[]
[]
[]
[]
[]
[]
[]
[]
[]
[]
[]
[]
[]
[]
[]
[]
["自己保有機械器具〔宮城県内に保有するものに限る〕"]
["名　　称",null,null,null,null,null,"種　　　類",null,null,null,null,null,null,null,null,null,"能　　力",null,null,null,null,"数量",null,"名　　称",null,null,null,null,null,"種　　　類",null,null,null,null,null,null,null,null,null,"能　　力",null,null,null,null,"数量"]
[]
[]
[]
[]
[]
[null,null,null,null,null,null,null,null,null,null,null,null,null,null,null,null,null,null,null,null,null,null,null,null,null,null,null,null,null,null,null,null,null,null,null,null,null,{"$f":"'1入力ｼｰﾄ'!N316","v":""},null,null,null,{"$f":"'1入力ｼｰﾄ'!U316","v":""}]

{"sheet":"出力ｼｰﾄ1","index":6,"n_rows":455,"n_cols":40,"rows_kept":455,"cut":false,"hidden":false,"merged":[[424,0,425,33],[429,5,430,26],[58,25,58,28],[14,31,14,32],[15,29,15,30],[15,31,15,32],[21,31,21,32],[32,31,32,32],[29,31,29,32],[58,29,58,31],[19,31,19,32],[19,29,19,30],[27,31,27,32],[31,31,31,32],[30,31,30,32],[33,31,33,32],[35,31,35,32],[23,29,23,30],[24,29,24,30],[26,31,26,32],[23,31,23,32],[56,31,56,32],[54,31,54,32],[71,11,71,32],[10,11,10,28],[3,15,3,20],[9,1,9,10],[11,6,11,10],[8,11,8,28],[11,1,12,5],[2,0,2,32],[9,31,9,32],[12,31,12,32],[7,31,7,32],[7,0,17,0],[7,11,7,28],[5,11,5,28],[6,1,6,10],[17,11,17,28],[12,11,12,28],[14,6,14,10],[13,11,13,28],[9,29,9,30],[11,11,11,28],[13,6,13,10],[16,6,16,10],[15,6,15,10],[12,29,12,30],[5,31,5,32],[6,31,6,32],[8,31,8,32],[6,29,6,30],[5,29,5,30],[11,31,11,32],[11,29,11,30],[22,31,22,32],[18,31,18,32],[16,31,16,32],[17,31,17,32],[20,31,20,32],[17,29,17,30],[10,29,10,30],[10,31,10,32],[7,29,7,30],[13,29,13,30],[16,29,16,30],[14,29,14,30],[8,29,8,30],[13,31,13,32],[28,31,28,32],[24,31,24,32],[25,31,25,32],[40,31,40,32],[36,31,36,32],[39,31,39,32],[51,31,51,32],[43,31,43,32],[41,31,41,32],[38,31,38,32],[34,31,34,32],[37,31,37,32],[44,31,44,32],[42,31,42,32],[45,31,45,32],[48,31,48,32],[50,31,50,32],[47,31,47,32],[46,31,46,32],[49,31,49,32],[67,1,67,10],[68,1,68,10],[69,1,69,10],[87,11,87,32],[86,6,86,10],[79,1,79,10],[83,1,83,10],[86,11,86,32],[76,11,76,32],[69,11,69,32],[81,6,81,10],[72,1,76,5],[80,6,80,10],[74,11,74,32],[75,11,75,32],[84,11,84,32],[74,6,74,10],[72,11,72,32],[68,11,68,32],[78,6,78,10],[50,29,50,30],[51,29,51,30],[51,23,51,28],[52,23,52,28],[54,29,54,30],[53,11,53,16],[52,17,52,22],[61,20,62,32],[64,5,64,12],[61,5,61,12],[52,29,52,30],[58,0,58,6],[62,14,62,16],[62,17,62,19],[62,5,62,12],[55,29,55,30],[62,0,64,4],[61,0,61,4],[55,17,55,22],[55,23,55,28],[55,31,55,32],[52,31,52,32],[59,29,59,32],[59,2,59,12],[110,0,112,0],[71,6,71,10],[103,29,103,30],[98,0,99,32],[70,0,83,0],[70,11,70,32],[101,15,101,20],[103,1,103,13],[103,14,103,28],[72,6,72,10],[73,11,73,32],[108,29,109,30],[108,31,109,32],[93,11,93,32],[88,11,88,32],[89,11,89,32],[76,6,76,10],[77,1,78,5],[78,11,78,32],[88,6,88,10],[91,11,91,32],[84,6,84,10],[87,6,87,10],[108,1,109,13],[122,31,123,32],[108,14,109,28],[120,29,121,30],[146,29,148,30],[130,29,132,30],[124,14,125,28],[128,31,129,32],[103,31,103,32],[118,31,119,32],[106,31,107,32],[110,31,112,32],[118,29,119,30],[144,31,145,32],[156,29,156,31],[156,25,156,28],[180,19,180,20],[180,11,180,15],[179,22,179,23],[177,17,177,32],[161,0,161,33],[149,31,152,32],[146,14,148,28],[144,14,145,28],[212,7,213,8],[179,25,179,26],[175,11,175,15],[179,17,179,18],[178,17,178,32],[173,11,173,15],[179,19,179,20],[163,23,163,31],[146,31,148,32],[223,3,223,29],[226,1,226,32],[239,2,239,10],[212,27,212,33],[212,2,213,6],[277,20,279,22],[277,23,277,25],[269,12,269,29],[265,12,266,29],[218,0,218,33],[212,17,213,18],[212,19,213,25],[262,12,264,29],[255,12,255,29],[216,0,216,5],[271,12,271,13],[270,12,270,13],[277,26,277,28],[277,29,279,31],[250,12,252,29],[212,0,213,1],[212,9,212,16],[213,9,213,16],[268,12,268,25],[396,29,396,31],[284,2,284,10],[375,1,376,8],[365,1,370,5],[382,2,384,31],[378,2,379,31],[373,1,374,18],[365,6,370,32],[338,14,340,19],[343,21,343,26],[343,28,347,33],[296,11,296,15],[296,17,297,32],[294,11,294,15],[336,29,336,31],[336,25,336,28],[309,9,310,22],[361,1,364,5],[352,0,353,33],[359,6,360,32],[299,17,299,32],[299,11,299,15],[293,17,295,32],[63,5,63,12],[447,3,448,30],[405,22,406,33],[403,22,404,33],[403,0,403,3],[278,23,279,25],[270,14,270,15],[359,1,360,5],[400,0,400,15],[400,18,400,33],[393,23,394,32],[395,23,395,32],[339,1,340,11],[341,1,341,11],[428,28,429,33],[380,2,381,31],[405,4,406,15],[404,0,404,3],[403,4,404,15],[403,18,403,21],[404,18,404,21],[398,0,398,15],[398,18,398,33],[153,31,154,32],[51,11,51,16],[51,17,51,22],[66,11,66,32],[56,17,56,22],[56,11,56,16],[24,6,24,10],[26,1,26,10],[84,0,92,0],[84,1,92,5],[56,2,56,10],[54,0,54,1],[70,1,71,5],[67,0,69,0],[66,1,66,10],[90,6,90,10],[91,6,91,10],[92,6,92,10],[18,0,24,0],[25,1,25,10],[70,6,70,10],[85,6,85,10],[82,1,82,10],[80,1,81,5],[77,6,77,10],[55,2,55,10],[49,11,49,28],[48,6,48,10],[75,6,75,10],[73,6,73,10],[25,0,36,0],[56,0,56,1],[37,0,47,0],[54,23,54,28],[40,6,40,10],[47,6,47,10],[44,6,44,10],[28,11,28,17],[26,11,26,17],[51,0,51,10],[49,6,49,10],[28,6,28,10],[27,1,27,10],[55,11,55,16],[55,0,55,1],[54,17,54,22],[54,2,54,10],[54,11,54,16],[37,6,37,10],[29,29,29,30],[39,6,39,10],[35,11,35,13],[36,11,36,13],[31,11,31,28],[36,29,36,30],[29,18,29,28],[31,1,31,10],[29,11,29,17],[30,1,30,10],[29,6,29,10],[32,11,32,28],[32,1,32,10],[30,11,30,28],[35,1,35,10],[35,29,35,30],[39,11,39,28],[32,29,32,30],[36,14,36,28],[172,17,174,32],[169,17,171,32],[159,0,159,33],[454,12,454,16],[344,14,347,19],[144,1,145,13],[454,7,454,10],[177,14,177,15],[178,11,178,15],[175,17,176,32],[180,17,180,18],[153,29,154,30],[278,26,279,28],[270,17,270,18],[270,20,270,21],[361,6,364,32],[343,0,347,5],[343,14,343,19],[336,0,336,5],[343,7,347,12],[344,21,347,26],[156,0,156,5],[282,0,282,33],[396,25,396,28],[45,6,45,10],[46,6,46,10],[452,7,453,32],[267,12,267,31],[217,25,217,28],[179,11,179,15],[184,1,184,32],[53,2,53,10],[50,0,50,10],[106,0,107,0],[67,11,67,32],[96,17,96,19],[61,14,61,16],[61,17,61,19],[89,6,89,10],[83,11,83,32],[56,23,56,28],[56,29,56,30],[77,11,77,32],[253,12,254,29],[216,17,216,20],[216,21,216,23],[217,29,217,31],[85,11,85,32],[0,14,0,16],[0,17,0,19],[1,17,1,19],[0,20,1,33],[53,31,53,32],[48,11,48,28],[53,23,53,28],[50,11,50,28],[0,1,0,12],[53,0,53,1],[43,11,43,28],[21,29,21,30],[33,11,33,28],[22,29,22,30],[33,29,33,30],[40,11,40,28],[38,6,38,10],[35,14,35,28],[28,1,29,5],[26,18,26,28],[52,11,52,16],[23,6,23,10],[52,0,52,1],[48,0,49,5],[42,6,42,10],[41,6,41,10],[52,2,52,10],[37,11,37,28],[1,14,1,16],[18,11,18,28],[20,6,20,10],[18,1,20,5],[22,11,22,28],[18,6,18,10],[19,11,19,28],[20,11,20,28],[19,6,19,10],[21,1,21,10],[22,6,22,10],[22,1,24,5],[9,11,9,28],[7,1,7,10],[5,1,5,10],[6,11,6,28],[8,1,8,10],[46,11,46,28],[12,6,12,10],[14,11,14,28],[13,1,17,5],[17,6,17,10],[15,11,15,28],[16,11,16,28],[10,1,10,10],[53,29,53,30],[18,29,18,30],[34,11,34,28],[27,11,27,28],[30,29,30,30],[21,11,21,28],[37,29,37,30],[31,29,31,30],[20,29,20,30],[23,11,23,28],[34,29,34,30],[24,11,24,28],[25,11,25,28],[53,17,53,22],[27,29,27,30],[25,29,25,30],[26,29,26,30],[28,29,28,30],[28,18,28,28],[80,11,80,32],[79,11,79,32],[82,11,82,32],[141,1,143,13],[110,14,112,28],[146,1,148,13],[130,1,132,13],[106,1,107,13],[97,17,97,19],[110,1,112,13],[90,11,90,32],[93,0,94,5],[93,6,93,10],[94,6,94,10],[141,0,143,0],[104,0,105,0],[104,1,105,13],[108,0,109,0],[106,29,107,30],[110,29,112,30],[97,14,97,16],[96,14,96,16],[94,11,94,32],[137,31,140,32],[122,0,123,0],[120,14,121,28],[126,0,127,0],[130,14,132,28],[126,14,127,28],[133,0,136,0],[122,1,123,13],[120,1,121,13],[81,11,81,32],[126,29,127,30],[133,29,136,30],[124,31,125,32],[124,29,125,30],[128,14,129,28],[128,1,129,13],[124,1,125,13],[106,14,107,28],[113,29,117,30],[113,14,117,28],[118,14,119,28],[120,31,121,32],[113,31,117,32],[122,14,123,28],[126,1,127,13],[133,31,136,32],[118,0,119,0],[96,20,97,33],[96,1,96,12],[141,31,143,32],[130,31,132,32],[126,31,127,32],[141,29,143,30],[92,11,92,32],[104,14,105,28],[104,29,105,30],[104,31,105,32],[137,0,140,0],[113,0,117,0],[113,1,117,13],[130,0,132,0],[137,1,140,13],[118,1,119,13],[133,1,136,13],[128,0,129,0],[122,29,123,30],[133,14,136,28],[124,0,125,0],[120,0,121,0],[153,0,154,0],[144,29,145,30],[144,0,145,0],[146,0,148,0],[149,0,152,0],[141,14,143,28],[128,29,129,30],[137,29,140,30],[153,1,154,13],[153,14,154,28],[149,29,152,30],[137,14,140,28],[149,1,152,13],[149,14,152,28],[49,29,49,30],[34,6,34,10],[37,1,47,5],[43,6,43,10],[33,1,34,5],[48,29,48,30],[40,29,40,30],[38,11,38,28],[43,29,43,30],[45,29,45,30],[41,11,41,28],[45,11,45,28],[39,29,39,30],[42,29,42,30],[41,29,41,30],[38,29,38,30],[44,29,44,30],[47,29,47,30],[46,29,46,30],[44,11,44,28],[36,1,36,10],[33,6,33,10],[47,11,47,28],[42,11,42,28]]}
[null,"記載内容確認書",null,null,null,null,null,null,null,null,null,null,null,null,"大分類",null,null,"小分類",null,null,{"$f":"IF('1入力ｼｰﾄ'!E96=0,\"\",'1入力ｼｰﾄ'!E96)","v":""}]
[null,null,null,null,null,null,null,null,null,null,null,null,null,null,{"$f":"IF('1入力ｼｰﾄ'!B293=0,\"\",LEFT('1入力ｼｰﾄ'!B293,3))","v":""},null,null,{"$f":"IF('1入力ｼｰﾄ'!I293=0,\"\",LEFT('1入力ｼｰﾄ'!I293,3))","v":""}]
["仙台市競争入札参加資格審査申請書の下記記載内容について確認しましたので提出いたします。"]
[null,null,null,null,null,null,null,null,null,null,null,null,null,null,null,"作成担当者署名："]
[]
[null,"申請項目",null,null,null,null,null,null,null,null,null,"申請内容",null,null,null,null,null,null,null,null,null,null,null,null,null,null,null,null,null,"作成\n担当者\n確認☑",null,"仙台市\n確認"]
[null,"申請年月日",null,null,null,null,null,null,null,null,null,{"$f":"IF('1入力ｼｰﾄ'!G41=0,\"\",'1入力ｼｰﾄ'!E41&IF('1入力ｼｰﾄ'!G41=0,\"　　\",'1入力ｼｰﾄ'!G41)&'1入力ｼｰﾄ'!I41&IF('1入力ｼｰﾄ'!J41=0,\"　　\",'1入力ｼｰﾄ'!J41)&'1入力ｼｰﾄ'!L41&IF('1入力ｼｰﾄ'!M41=0,\"　　\",'1入力ｼｰﾄ'!M41)&'1入力ｼｰﾄ'!O41)","v":""},null,null,null,null,null,null,null,null,null,null,null,null,null,null,null,null,null,null,null,null,null,null,"申請日編集",{"$f":"SUBSTITUTE(SUBSTITUTE(L7,\"年0\",\"年\"),\"月0\",\"月\")","v":""}]
[null,"申請区分",null,null,null,null,null,null,null,null,null,{"$f":"IF('1入力ｼｰﾄ'!E46=0,\"\",'1入力ｼｰﾄ'!E46)","v":"新規"},null,null,null,null,null,null,null,null,null,null,null,null,null,null,null,null,null,null,null,null,null,null,"申請区分コード",{"$f":"IF(L8=\"\",\"\",IF(L8=\"新規\",10,12))","v":10}]
[null,"業者番号",null,null,null,null,null,null,null,null,null,{"$f":"IF('1入力ｼｰﾄ'!E54=0,\"\",'1入力ｼｰﾄ'!E54)","v":""}]
[null,"法人・個人",null,null,null,null,null,null,null,null,null,{"$f":"IF('1入力ｼｰﾄ'!E83=0,\"\",'1入力ｼｰﾄ'!E83)","v":""}]
[null,"法人番号",null,null,null,null,null,null,null,null,null,{"$f":"IF('1入力ｼｰﾄ'!E88=0,\"\",'1入力ｼｰﾄ'!E88)","v":""}]
[null,"業者名称",null,null,null,null,"漢字",null,null,null,null,{"$f":"IF('1入力ｼｰﾄ'!E96=0,\"\",'1入力ｼｰﾄ'!E96)","v":""}]
[null,null,null,null,null,null,"フリガナ",null,null,null,null,{"$f":"IF('1入力ｼｰﾄ'!E101=0,\"\",'1入力ｼｰﾄ'!E101)","v":""}]
[null,"代表者",null,null,null,null,"職名",null,null,null,null,{"$f":"IF('1入力ｼｰﾄ'!E106=0,\"\",'1入力ｼｰﾄ'!E106)","v":""}]
[null,null,null,null,null,null,"氏名(漢字）",null,null,null,null,{"$f":"IF('1入力ｼｰﾄ'!E111=0,\"\",'1入力ｼｰﾄ'!E111)","v":""}]
[null,null,null,null,null,null,"(フリガナ）",null,null,null,null,{"$f":"IF('1入力ｼｰﾄ'!E116=0,\"\",'1入力ｼｰﾄ'!E116)","v":""}]
[null,null,null,null,null,null,"生年月日",null,null,null,null,{"$f":"IF('1入力ｼｰﾄ'!G120=0,\"\",'1入力ｼｰﾄ'!E120&'1入力ｼｰﾄ'!G120&'1入力ｼｰﾄ'!I120&'1入力ｼｰﾄ'!J120&'1入力ｼｰﾄ'!L120&'1入力ｼｰﾄ'!M120&'1入力ｼｰﾄ'!O120)","v":""}]
[null,null,null,null,null,null,"性別",null,null,null,null,{"$f":"IF('1入力ｼｰﾄ'!E124=0,\"\",'1入力ｼｰﾄ'!E124)","v":""}]
["所在地","本社所在地",null,null,null,null,"郵便番号",null,null,null,null,{"$f":"IF('1入力ｼｰﾄ'!E130=0,\"\",'1入力ｼｰﾄ'!E130&'1入力ｼｰﾄ'!H130&'1入力ｼｰﾄ'!I130)","v":""}]
[null,null,null,null,null,null,"都道府県",null,null,null,null,{"$f":"IF('1入力ｼｰﾄ'!E134=0,\"\",'1入力ｼｰﾄ'!E134)","v":""}]
[null,null,null,null,null,null,"市区町村\n以降",null,null,null,null,{"$f":"IF('1入力ｼｰﾄ'!E141=0,\"\",'1入力ｼｰﾄ'!E141)","v":""}]
[null,"行政区",null,null,null,null,null,null,null,null,null,{"$f":"IF('1入力ｼｰﾄ'!E145=0,\"\",IF(L20=\"04 宮城県\",'1入力ｼｰﾄ'!E145,\"\"))","v":""}]
[null,"登記上の\n本社所在地",null,null,null,null,"郵便番号",null,null,null,null,{"$f":"IF('1入力ｼｰﾄ'!E151=0,\"\",'1入力ｼｰﾄ'!E151&'1入力ｼｰﾄ'!H151&'1入力ｼｰﾄ'!I151)","v":""},null,null,null,null,null,null,null,null,null,null,null,null,null,null,null,null,null,null,null,null,null,null,null,null,null,{"$f":"\"概要：　地域コードの出力シート２へ反映する式を修正\"","v":"概要：　地域コードの出力シート２へ反映する式を修正"}]
[null,null,null,null,null,null,"都道府県",null,null,null,null,{"$f":"IF('1入力ｼｰﾄ'!E155=0,\"\",'1入力ｼｰﾄ'!E155)","v":""},null,null,null,null,null,null,null,null,null,null,null,null,null,null,null,null,null,null,null,null,null,null,"地域コード",{"$f":"IF(AJ26=\"error\",\"\",AJ25)","v":""},null,"変更前",{"$f":"IF(L20=\"\",\"\",IF(LEFT(L20,2)=\"04\",IF(L22=\"\",\"0299\",\"01\"&LEFT(L22,2)),\"0399\"))","v":""}]
[null,null,null,null,null,null,"市区町村\n以降",null,null,null,null,{"$f":"IF('1入力ｼｰﾄ'!E162=0,\"\",'1入力ｼｰﾄ'!E162)","v":""},null,null,null,null,null,null,null,null,null,null,null,null,null,null,null,null,null,null,null,null,null,null,"入力した値のチェック",{"$f":"IF(L20=\"\",\"\",IF(LEFT(L20,2)=\"04\",IF(LEFT(L21,3)=\"仙台市\",\"01\"&LEFT(L22,2),\"0299\"),\"0399\"))","v":""},null,"変更後の概要","都道府県が空欄の場合は処理しない、宮城以外が入った場合は0399を、宮城が入り、かつ仙台市だった場合は01と行政区の最初2文字を合わせたものを、仙台市でなかった場合は0299を表示する。\nその後、エラーチェックにエラーがなければ出力シート２へ反映させる"]
["会社情報","創業年月日",null,null,null,null,null,null,null,null,null,{"$f":"IF('1入力ｼｰﾄ'!E167=0,\"\",'1入力ｼｰﾄ'!E167&'1入力ｼｰﾄ'!I167&'1入力ｼｰﾄ'!J167&'1入力ｼｰﾄ'!L167&'1入力ｼｰﾄ'!M167&'1入力ｼｰﾄ'!O167)","v":""},null,null,null,null,null,null,null,null,null,null,null,null,null,null,null,null,null,null,null,null,null,null,null,{"$f":"IF(COUNTIF(AJ27:AJ29,\"error\")>0,\"error\",\"\")","v":""},"エラーチェック"]
[null,"資本金(千円）",null,null,null,null,null,null,null,null,null,{"$f":"IF('1入力ｼｰﾄ'!E172=0,0,'1入力ｼｰﾄ'!E172)","v":0},null,null,null,null,null,null,null,null,null,null,null,null,null,null,null,null,null,null,null,null,null,null,null,{"$f":"IF(LEFT(L21,3)<>\"仙台市\",IF(L22=\"\",\"\",\"error\"),\"\")","v":""},"仙台市以外のときに行政区が入ってたらエラー"]
[null,"外国資本の割合（％）",null,null,null,null,null,null,null,null,null,{"$f":"IF('1入力ｼｰﾄ'!E177=0,0,'1入力ｼｰﾄ'!E177)","v":0},null,null,null,null,null,null,null,null,null,null,null,null,null,null,null,null,null,null,null,null,null,null,null,{"$f":"IF(LEFT(L20,2)<>\"04\",IF(L22=\"\",\"\",\"error\"),\"\")","v":""},"宮城県以外のときに行政区が入ってたらエラー"]
[null,"売上高（千円）",null,null,null,null,"前年度",null,null,null,null,{"$f":"IF('1入力ｼｰﾄ'!E182=0,0,'1入力ｼｰﾄ'!E182)","v":0},null,null,null,null,null,null,null,null,null,null,null,null,null,null,null,null,null,null,null,null,null,null,null,{"$f":"IF(LEFT(L21,3)=\"仙台市\",IF(L22=\"\",\"error\",\"\"),\"\")","v":""},"仙台市の時に行政区が入っていなければエラー"]
[null,null,null,null,null,null,"前々年度",null,null,null,null,{"$f":"IF('1入力ｼｰﾄ'!E183=0,0,'1入力ｼｰﾄ'!E183)","v":0}]
[null,"電話番号",null,null,null,null,null,null,null,null,null,{"$f":"IF('1入力ｼｰﾄ'!E188=0,\"\",'1入力ｼｰﾄ'!E188)","v":""}]
[null,"ＦＡＸ",null,null,null,null,null,null,null,null,null,{"$f":"IF('1入力ｼｰﾄ'!E189=0,\"\",'1入力ｼｰﾄ'!E189)","v":""}]
[null,"従業員数(人）",null,null,null,null,null,null,null,null,null,{"$f":"IF('1入力ｼｰﾄ'!E193=0,0,'1入力ｼｰﾄ'!E193)","v":0},null,null,null,null,null,null,null,null,null,null,null,null,null,null,null,null,null,null,null,null,null,null,"切捨て編集","出力リスト２編集エリア"]
[null,"障害者雇用(人）",null,null,null,null,"法定雇用数",null,null,null,null,{"$f":"IF('1入力ｼｰﾄ'!E197=0,0,'1入力ｼｰﾄ'!E197)","v":0},null,null,null,null,null,null,null,null,null,null,null,null,null,null,null,null,null,null,null,null,null,null,{"$f":"ROUNDDOWN('1入力ｼｰﾄ'!E197,0)","v":0},{"$f":"IF($L33<AI34,\"\",AI34)","v":0}]
[null,null,null,null,null,null,"実雇用数",null,null,null,null,{"$f":"IF('1入力ｼｰﾄ'!E201=0,0,'1入力ｼｰﾄ'!E201)","v":0},null,null,null,null,null,null,null,null,null,null,null,null,null,null,null,null,null,null,null,null,null,null,{"$f":"ROUNDDOWN('1入力ｼｰﾄ'!E201,0)","v":0},{"$f":"IF($L$33<AI35,\"\",AI35)","v":0},null,{"$f":"\"概要：　ＩＳＯ9000シリーズ、ＩＳＯ14000シリーズの出力シート２へ反映する式を変更\"","v":"概要：　ＩＳＯ9000シリーズ、ＩＳＯ14000シリーズの出力シート２へ反映する式を変更"}]
[null,"ＩＳＯ9000シリーズ",null,null,null,null,null,null,null,null,null,{"$f":"IF('1入力ｼｰﾄ'!E205=0,0,IF('1入力ｼｰﾄ'!AO206<='1入力ｼｰﾄ'!AO207,1,IF('1入力ｼｰﾄ'!AO208=TRUE,1,0)))","v":0},null,null,{"$f":"IF('1入力ｼｰﾄ'!E205=0,\"\",'1入力ｼｰﾄ'!AP207&IF('1入力ｼｰﾄ'!AO208=TRUE,'1入力ｼｰﾄ'!AN204,IF('1入力ｼｰﾄ'!AO206<='1入力ｼｰﾄ'!AO207,\"\",\"有効期限注意\")))","v":""},null,null,null,null,null,null,null,null,null,null,null,null,null,null,null,null,null,null,null,null,{"$f":"IF(L36=1,IF('1入力ｼｰﾄ'!AO206<='1入力ｼｰﾄ'!AO207,1,IF('1入力ｼｰﾄ'!AO208=TRUE,1,0)),0)","v":0},null,{"$f":"\"理由：　業者に「更新手続き中の場合は、チェックを入れて更新前の有効期限を選択」をさせているが、　選択した更新前の有効期限が（=申請要領!D37）より前だった場合に、出力シート２へスペースが入ってしまうため　（出力シート２へは１か０が入ったほうが良い）\"","v":"理由：　業者に「更新手続き中の場合は、チェックを入れて更新前の有効期限を選択」をさせているが、　選択した更新前の有効期限が（=申請要領!D37）より前だった場合に、出力シート２へスペースが入ってしまうため　（出力シート２へは１か０が入ったほうが良い）"}]
[null,"ＩＳＯ14000シリーズ",null,null,null,null,null,null,null,null,null,{"$f":"IF('1入力ｼｰﾄ'!E212=0,0,IF('1入力ｼｰﾄ'!AO212<='1入力ｼｰﾄ'!AO213,1,IF('1入力ｼｰﾄ'!AO214=TRUE,1,0)))","v":0},null,null,{"$f":"IF('1入力ｼｰﾄ'!E212=0,\"\",'1入力ｼｰﾄ'!AP213&IF('1入力ｼｰﾄ'!AO214=TRUE,'1入力ｼｰﾄ'!AN204,IF('1入力ｼｰﾄ'!AO212<='1入力ｼｰﾄ'!AO213,\"\",\"有効期限注意\")))","v":""},null,null,null,null,null,null,null,null,null,null,null,null,null,null,null,null,null,null,null,null,{"$f":"IF(L37=1,IF('1入力ｼｰﾄ'!AO212<='1入力ｼｰﾄ'!AO213,1,IF('1入力ｼｰﾄ'!AO214=TRUE,1,0)),0)","v":0},null,"変更前の式：",{"$f":"IF(L36=1,IF('1入力ｼｰﾄ'!AO206<='1入力ｼｰﾄ'!AO207,1,IF('1入力ｼｰﾄ'!AO208=TRUE,\"\",0)),0)","v":0},{"$f":"IF(L37=1,IF('1入力ｼｰﾄ'!AO212<='1入力ｼｰﾄ'!AO213,1,IF('1入力ｼｰﾄ'!AO214=TRUE,\"\",0)),0)","v":0}]
["受任者","受任者",null,null,null,null,"名称",null,null,null,null,{"$f":"IF(AJ38=1,AI39,IF('1入力ｼｰﾄ'!E222=0,\"\",'1入力ｼｰﾄ'!E222))","v":""},null,null,null,null,null,null,null,null,null,null,null,null,null,null,null,null,null,null,null,null,null,null,"受任者廃止S",{"$f":"IF('1入力ｼｰﾄ'!AN218=TRUE,1,0)","v":0}]
[null,null,null,null,null,null,"郵便番号",null,null,null,null,{"$f":"IF(AJ38=1,\"\",IF('1入力ｼｰﾄ'!E227=0,\"\",'1入力ｼｰﾄ'!E227&'1入力ｼｰﾄ'!H227&'1入力ｼｰﾄ'!I227))","v":""},null,null,null,null,null,null,null,null,null,null,null,null,null,null,null,null,null,null,null,null,null,null,"受任者廃止"]
[null,null,null,null,null,null,"都道府県",null,null,null,null,{"$f":"IF(AJ38=1,\"\",IF('1入力ｼｰﾄ'!E231=0,\"\",'1入力ｼｰﾄ'!E231))","v":""}]
[null,null,null,null,null,null,"市区町村\n以降",null,null,null,null,{"$f":"IF(AJ38=1,\"\",IF('1入力ｼｰﾄ'!E238=0,\"\",'1入力ｼｰﾄ'!E238))","v":""}]
[null,null,null,null,null,null,"電話番号",null,null,null,null,{"$f":"IF(AJ38=1,\"\",IF('1入力ｼｰﾄ'!E243=0,\"\",'1入力ｼｰﾄ'!E243))","v":""}]
[null,null,null,null,null,null,"ＦＡＸ",null,null,null,null,{"$f":"IF(AJ38=1,\"\",IF('1入力ｼｰﾄ'!E244=0,\"\",'1入力ｼｰﾄ'!E244))","v":""}]
[null,null,null,null,null,null,"職名",null,null,null,null,{"$f":"IF(AJ38=1,\"\",IF('1入力ｼｰﾄ'!E249=0,\"\",'1入力ｼｰﾄ'!E249))","v":""}]
[null,null,null,null,null,null,"氏名(漢字）",null,null,null,null,{"$f":"IF(AJ38=1,\"\",IF('1入力ｼｰﾄ'!E254=0,\"\",'1入力ｼｰﾄ'!E254))","v":""},null,null,null,null,null,null,null,null,null,null,null,null,null,null,null,null,null,null,null,null,null,null,null,null,null,"大･小分類にエラーがある場合は、出力シート２には出力しない"]
[null,null,null,null,null,null,"(フリガナ）",null,null,null,null,{"$f":"IF(AJ38=1,\"\",IF('1入力ｼｰﾄ'!E259=0,\"\",'1入力ｼｰﾄ'!E259))","v":""},null,null,null,null,null,null,null,null,null,null,null,null,null,null,null,null,null,null,null,null,null,null,null,null,null,"エラーチェック",{"$f":"IF(COUNTIF(AM47:AM119,\"error\")>0,\"error\",\"ok\")","v":"ok"}]
[null,null,null,null,null,null,"生年月日",null,null,null,null,{"$f":"IF(AJ38=1,\"\",IF('1入力ｼｰﾄ'!G263=0,\"\",'1入力ｼｰﾄ'!E263&'1入力ｼｰﾄ'!G263&'1入力ｼｰﾄ'!I263&'1入力ｼｰﾄ'!J263&'1入力ｼｰﾄ'!L263&'1入力ｼｰﾄ'!M263&'1入力ｼｰﾄ'!O263))","v":""},null,null,null,null,null,null,null,null,null,null,null,null,null,null,null,null,null,null,null,null,null,null,null,null,null,"大分類１",{"$f":"IF('1入力ｼｰﾄ'!B294='1入力ｼｰﾄ'!AN$292,\"error\",\"ok\")","v":"ok"}]
[null,null,null,null,null,null,"性別",null,null,null,null,{"$f":"IF(AJ38=1,\"\",IF('1入力ｼｰﾄ'!E267=0,\"\",'1入力ｼｰﾄ'!E267))","v":""},null,null,null,null,null,null,null,null,null,null,null,null,null,null,null,null,null,null,null,null,null,null,null,null,null,"大分類２",{"$f":"IF('1入力ｼｰﾄ'!B296='1入力ｼｰﾄ'!AN$292,\"error\",\"ok\")","v":"ok"}]
["連絡先",null,null,null,null,null,"電話番号",null,null,null,null,{"$f":"IF('1入力ｼｰﾄ'!E273=0,\"\",'1入力ｼｰﾄ'!E273&IF('1入力ｼｰﾄ'!S273=\"\",\"\",\"本社又は受任者と同じです\"))","v":""},null,null,null,null,null,null,null,null,null,null,null,null,null,null,null,null,null,null,null,null,null,null,null,{"$f":"IF('1入力ｼｰﾄ'!AN270=TRUE,\"#\",IF('1入力ｼｰﾄ'!E273=0,\"\",IF('1入力ｼｰﾄ'!S273=\"\",'1入力ｼｰﾄ'!E273,\"\")))","v":""},null,"大分類３",{"$f":"IF('1入力ｼｰﾄ'!B298='1入力ｼｰﾄ'!AN$292,\"error\",\"ok\")","v":"ok"}]
[null,null,null,null,null,null,"ＦＡＸ",null,null,null,null,{"$f":"IF('1入力ｼｰﾄ'!E274=0,\"\",'1入力ｼｰﾄ'!E274&IF('1入力ｼｰﾄ'!S274=\"\",\"\",\"本社又は受任者と同じです\"))","v":""},null,null,null,null,null,null,null,null,null,null,null,null,null,null,null,null,null,null,null,null,null,null,null,{"$f":"IF('1入力ｼｰﾄ'!AN270=TRUE,\"#\",IF('1入力ｼｰﾄ'!E274=0,\"\",IF('1入力ｼｰﾄ'!S274=\"\",'1入力ｼｰﾄ'!E274,\"\")))","v":""},null,"大分類４",{"$f":"IF('1入力ｼｰﾄ'!B300='1入力ｼｰﾄ'!AN$292,\"error\",\"ok\")","v":"ok"}]
["申請種目",null,null,null,null,null,null,null,null,null,null,"小分類",null,null,null,null,null,null,null,null,null,null,null,null,null,null,null,null,null,null,null,null,null,null,null,null,null,"大分類５",{"$f":"IF('1入力ｼｰﾄ'!B302='1入力ｼｰﾄ'!AN$292,\"error\",\"ok\")","v":"ok"}]
["大分類",null,null,null,null,null,null,null,null,null,null,"第1希望",null,null,null,null,null,"第2希望",null,null,null,null,null,"第3希望",null,null,null,null,null,null,null,null,null,null,null,null,null,"大分類６",{"$f":"IF('1入力ｼｰﾄ'!B304='1入力ｼｰﾄ'!AN$292,\"error\",\"ok\")","v":"ok"}]
["第1",null,{"$f":"IF('1入力ｼｰﾄ'!B293=0,\"\",'1入力ｼｰﾄ'!B293&\"　\"&IF('1入力ｼｰﾄ'!B294=\"\",\"\",AI$53))","v":""},null,null,null,null,null,null,null,null,{"$f":"IF('1入力ｼｰﾄ'!I293=0,\"\",'1入力ｼｰﾄ'!I293&'1入力ｼｰﾄ'!L293)","v":""},null,null,null,null,null,{"$f":"IF('1入力ｼｰﾄ'!S293=0,\"\",'1入力ｼｰﾄ'!S293&'1入力ｼｰﾄ'!V293)","v":""},null,null,null,null,null,{"$f":"IF('1入力ｼｰﾄ'!AC293=0,\"\",'1入力ｼｰﾄ'!AC293&'1入力ｼｰﾄ'!AF293)","v":""},null,null,null,null,null,null,null,null,null,null,"重複不可！",null,null,"小分類１１",{"$f":"IF(OR('1入力ｼｰﾄ'!L293='1入力ｼｰﾄ'!AN$294,'1入力ｼｰﾄ'!L293='1入力ｼｰﾄ'!AN$296),\"error\",\"ok\")","v":"ok"}]
["第2",null,{"$f":"IF('1入力ｼｰﾄ'!B295=0,\"\",'1入力ｼｰﾄ'!B295&\"　\"&IF('1入力ｼｰﾄ'!B296=\"\",\"\",AI$53))","v":""},null,null,null,null,null,null,null,null,{"$f":"IF('1入力ｼｰﾄ'!I295=0,\"\",'1入力ｼｰﾄ'!I295&'1入力ｼｰﾄ'!L295)","v":""},null,null,null,null,null,{"$f":"IF('1入力ｼｰﾄ'!S295=0,\"\",'1入力ｼｰﾄ'!S295&'1入力ｼｰﾄ'!V295)","v":""},null,null,null,null,null,{"$f":"IF('1入力ｼｰﾄ'!AC295=0,\"\",'1入力ｼｰﾄ'!AC295&'1入力ｼｰﾄ'!AF295)","v":""},null,null,null,null,null,null,null,null,null,null,null,null,null,"小分類１２",{"$f":"IF(OR('1入力ｼｰﾄ'!V293='1入力ｼｰﾄ'!AN$294,'1入力ｼｰﾄ'!V293='1入力ｼｰﾄ'!AN$296),\"error\",\"ok\")","v":"ok"}]
["第3",null,{"$f":"IF('1入力ｼｰﾄ'!B297=0,\"\",'1入力ｼｰﾄ'!B297&\"　\"&IF('1入力ｼｰﾄ'!B298=\"\",\"\",AI$53))","v":""},null,null,null,null,null,null,null,null,{"$f":"IF('1入力ｼｰﾄ'!I297=0,\"\",'1入力ｼｰﾄ'!I297&'1入力ｼｰﾄ'!L297)","v":""},null,null,null,null,null,{"$f":"IF('1入力ｼｰﾄ'!S297=0,\"\",'1入力ｼｰﾄ'!S297&'1入力ｼｰﾄ'!V297)","v":""},null,null,null,null,null,{"$f":"IF('1入力ｼｰﾄ'!AC297=0,\"\",'1入力ｼｰﾄ'!AC297&'1入力ｼｰﾄ'!AF297)","v":""},null,null,null,null,null,null,null,null,null,null,null,null,null,"小分類１３",{"$f":"IF(OR('1入力ｼｰﾄ'!AF293='1入力ｼｰﾄ'!AN$294,'1入力ｼｰﾄ'!AF293='1入力ｼｰﾄ'!AN$296),\"error\",\"ok\")","v":"ok"}]
["第4",null,{"$f":"IF('1入力ｼｰﾄ'!B299=0,\"\",'1入力ｼｰﾄ'!B299&\"　\"&IF('1入力ｼｰﾄ'!B300=\"\",\"\",AI$53))","v":""},null,null,null,null,null,null,null,null,{"$f":"IF('1入力ｼｰﾄ'!I299=0,\"\",'1入力ｼｰﾄ'!I299&'1入力ｼｰﾄ'!L299)","v":""},null,null,null,null,null,{"$f":"IF('1入力ｼｰﾄ'!S299=0,\"\",'1入力ｼｰﾄ'!S299&'1入力ｼｰﾄ'!V299)","v":""},null,null,null,null,null,{"$f":"IF('1入力ｼｰﾄ'!AC299=0,\"\",'1入力ｼｰﾄ'!AC299&'1入力ｼｰﾄ'!AF299)","v":""},null,null,null,null,null,null,null,null,null,null,null,null,null,"小分類２１",{"$f":"IF(OR('1入力ｼｰﾄ'!L295='1入力ｼｰﾄ'!AN$294,'1入力ｼｰﾄ'!L295='1入力ｼｰﾄ'!AN$296),\"error\",\"ok\")","v":"ok"}]
["第5",null,{"$f":"IF('1入力ｼｰﾄ'!B301=0,\"\",'1入力ｼｰﾄ'!B301&\"　\"&IF('1入力ｼｰﾄ'!B302=\"\",\"\",AI$53))","v":""},null,null,null,null,null,null,null,null,{"$f":"IF('1入力ｼｰﾄ'!I301=0,\"\",'1入力ｼｰﾄ'!I301&'1入力ｼｰﾄ'!L301)","v":""},null,null,null,null,null,{"$f":"IF('1入力ｼｰﾄ'!S301=0,\"\",'1入力ｼｰﾄ'!S301&'1入力ｼｰﾄ'!V301)","v":""},null,null,null,null,null,{"$f":"IF('1入力ｼｰﾄ'!AC301=0,\"\",'1入力ｼｰﾄ'!AC301&'1入力ｼｰﾄ'!AF301)","v":""},null,null,null,null,null,null,null,null,null,null,null,null,null,"小分類２２",{"$f":"IF(OR('1入力ｼｰﾄ'!V295='1入力ｼｰﾄ'!AN$294,'1入力ｼｰﾄ'!V295='1入力ｼｰﾄ'!AN$296),\"error\",\"ok\")","v":"ok"}]
[null,null,{"$f":"IF('1入力ｼｰﾄ'!B303=0,\"\",'1入力ｼｰﾄ'!B303&\"　\"&IF('1入力ｼｰﾄ'!B304=\"\",\"\",AI$53))","v":""},null,null,null,null,null,null,null,null,{"$f":"IF('1入力ｼｰﾄ'!I303=0,\"\",'1入力ｼｰﾄ'!I303&'1入力ｼｰﾄ'!L303)","v":""},null,null,null,null,null,{"$f":"IF('1入力ｼｰﾄ'!S303=0,\"\",'1入力ｼｰﾄ'!S303&'1入力ｼｰﾄ'!V303)","v":""},null,null,null,null,null,{"$f":"IF('1入力ｼｰﾄ'!AC303=0,\"\",'1入力ｼｰﾄ'!AC303&'1入力ｼｰﾄ'!AF303)","v":""},null,null,null,null,null,null,null,null,null,null,null,null,null,"小分類２３",{"$f":"IF(OR('1入力ｼｰﾄ'!AF295='1入力ｼｰﾄ'!AN$294,'1入力ｼｰﾄ'!AF295='1入力ｼｰﾄ'!AN$296),\"error\",\"ok\")","v":"ok"}]
[null,null,null,null,null,null,null,null,null,null,null,null,null,null,null,null,null,null,null,null,null,null,null,null,null,{"$f":"'1入力ｼｰﾄ'!N316","v":""},null,null,null,{"$f":"'1入力ｼｰﾄ'!U316","v":""},null,null,null,null,null,null,null,"小分類３１",{"$f":"IF(OR('1入力ｼｰﾄ'!L297='1入力ｼｰﾄ'!AN$294,'1入力ｼｰﾄ'!L297='1入力ｼｰﾄ'!AN$296),\"error\",\"ok\")","v":"ok"}]
[null,null,"代表者等確認書",null,null,null,null,null,null,null,null,null,null,null,null,null,null,null,null,null,null,null,null,null,null,null,null,null,null,"物 品"]
[]
["受付番号",null,null,null,null,"業者番号",null,null,null,null,null,null,null,null,"大分類",null,null,"小分類",null,null,{"$f":"IF('1入力ｼｰﾄ'!E96=0,\"\",'1入力ｼｰﾄ'!E96)","v":""}]
[{"$f":"IF('1入力ｼｰﾄ'!E52=0,\"\",'1入力ｼｰﾄ'!E52)","v":""},null,null,null,null,{"$f":"IF('1入力ｼｰﾄ'!E54=0,\"\",'1入力ｼｰﾄ'!E54)","v":""},null,null,null,null,null,null,null,null,{"$f":"IF('1入力ｼｰﾄ'!B293=0,\"\",LEFT('1入力ｼｰﾄ'!B293,3))","v":""},null,null,{"$f":"IF('1入力ｼｰﾄ'!I293=0,\"\",LEFT('1入力ｼｰﾄ'!I293,3))","v":""}]
[null,null,null,null,null,"法人番号"]
[null,null,null,null,null,{"$f":"IF('1入力ｼｰﾄ'!E88=0,\"\",'1入力ｼｰﾄ'!E88)","v":""}]
[]
[null,"申請項目",null,null,null,null,null,null,null,null,null,"申請内容"]
[null,"申請年月日",null,null,null,null,null,null,null,null,null,{"$f":"IF('1入力ｼｰﾄ'!G41=0,\"\",'1入力ｼｰﾄ'!E41&IF('1入力ｼｰﾄ'!G41=0,\"　　\",'1入力ｼｰﾄ'!G41)&'1入力ｼｰﾄ'!I41&IF('1入力ｼｰﾄ'!J41=0,\"　　\",'1入力ｼｰﾄ'!J41)&'1入力ｼｰﾄ'!L41&IF('1入力ｼｰﾄ'!M41=0,\"　　\",'1入力ｼｰﾄ'!M41)&'1入力ｼｰﾄ'!O41)","v":""},null,null,null,null,null,null,null,null,null,null,null,null,null,null,null,null,null,null,null,null,null,null,"申請日編集",{"$f":"SUBSTITUTE(SUBSTITUTE(L68,\"年0\",\"年\"),\"月0\",\"月\")","v":""}]
[null,"申請区分",null,null,null,null,null,null,null,null,null,{"$f":"IF('1入力ｼｰﾄ'!E46=0,\"\",'1入力ｼｰﾄ'!E46)","v":"新規"},null,null,null,null,null,null,null,null,null,null,null,null,null,null,null,null,null,null,null,null,null,null,"申請区分コード",{"$f":"IF(L69=\"\",\"\",IF(L69=\"新規\",10,12))","v":10}]
[null,"法人・個人",null,null,null,null,null,null,null,null,null,{"$f":"IF('1入力ｼｰﾄ'!E83=0,\"\",'1入力ｼｰﾄ'!E83)","v":""}]
["代表者","業者名称",null,null,null,null,"漢字",null,null,null,null,{"$f":"IF('1入力ｼｰﾄ'!E96=0,\"\",'1入力ｼｰﾄ'!E96)","v":""}]
[null,null,null,null,null,null,"フリガナ",null,null,null,null,{"$f":"IF('1入力ｼｰﾄ'!E101=0,\"\",'1入力ｼｰﾄ'!E101)","v":""}]
[null,"代表者",null,null,null,null,"職名",null,null,null,null,{"$f":"IF('1入力ｼｰﾄ'!E106=0,\"\",'1入力ｼｰﾄ'!E106)","v":""}]
[null,null,null,null,null,null,"氏名(漢字）",null,null,null,null,{"$f":"IF('1入力ｼｰﾄ'!E111=0,\"\",'1入力ｼｰﾄ'!E111)","v":""}]
[null,null,null,null,null,null,"(フリガナ）",null,null,null,null,{"$f":"IF('1入力ｼｰﾄ'!E116=0,\"\",'1入力ｼｰﾄ'!E116)","v":""}]
[null,null,null,null,null,null,"生年月日",null,null,null,null,{"$f":"IF('1入力ｼｰﾄ'!G120=0,\"\",'1入力ｼｰﾄ'!E120&'1入力ｼｰﾄ'!G120&'1入力ｼｰﾄ'!I120&'1入力ｼｰﾄ'!J120&'1入力ｼｰﾄ'!L120&'1入力ｼｰﾄ'!M120&'1入力ｼｰﾄ'!O120)","v":""}]
[null,null,null,null,null,null,"性別",null,null,null,null,{"$f":"IF('1入力ｼｰﾄ'!E124=0,\"\",'1入力ｼｰﾄ'!E124)","v":""}]
[null,"本社所在地",null,null,null,null,"都道府県",null,null,null,null,{"$f":"IF('1入力ｼｰﾄ'!E134=0,\"\",'1入力ｼｰﾄ'!E134)","v":""}]
[null,null,null,null,null,null,"市区町村\n以降",null,null,null,null,{"$f":"IF('1入力ｼｰﾄ'!E141=0,\"\",'1入力ｼｰﾄ'!E141)","v":""}]
[null,"行政区",null,null,null,null,null,null,null,null,null,{"$f":"IF('1入力ｼｰﾄ'!E145=0,\"\",IF(L20=\"04 宮城県\",'1入力ｼｰﾄ'!E145,\"\"))","v":""}]
[null,"登記上の\n本社所在地",null,null,null,null,"都道府県",null,null,null,null,{"$f":"IF('1入力ｼｰﾄ'!E155=0,\"\",'1入力ｼｰﾄ'!E155)","v":""},null,null,null,null,null,null,null,null,null,null,null,null,null,null,null,null,null,null,null,null,null,null,"地域コード",{"$f":"IF(#REF!=\"error\",\"\",AJ82)","v":{"$error":"#REF!"}},null,"変更前",{"$f":"IF(L78=\"\",\"\",IF(LEFT(L78,2)=\"04\",IF(L80=\"\",\"0299\",\"01\"&LEFT(L80,2)),\"0399\"))","v":""}]
[null,null,null,null,null,null,"市区町村\n以降",null,null,null,null,{"$f":"IF('1入力ｼｰﾄ'!E162=0,\"\",'1入力ｼｰﾄ'!E162)","v":""},null,null,null,null,null,null,null,null,null,null,null,null,null,null,null,null,null,null,null,null,null,null,"入力した値のチェック",{"$f":"IF(L78=\"\",\"\",IF(LEFT(L78,2)=\"04\",IF(LEFT(L79,3)=\"仙台市\",\"01\"&LEFT(L80,2),\"0299\"),\"0399\"))","v":""},null,"変更後の概要","都道府県が空欄の場合は処理しない、宮城以外が入った場合は0399を、宮城が入り、かつ仙台市だった場合は01と行政区の最初2文字を合わせたものを、仙台市でなかった場合は0299を表示する。\nその後、エラーチェックにエラーがなければ出力シート２へ反映させる"]
[null,"電話番号",null,null,null,null,null,null,null,null,null,{"$f":"IF('1入力ｼｰﾄ'!E188=0,\"\",'1入力ｼｰﾄ'!E188)","v":""}]
[null,"ＦＡＸ",null,null,null,null,null,null,null,null,null,{"$f":"IF('1入力ｼｰﾄ'!E189=0,\"\",'1入力ｼｰﾄ'!E189)","v":""}]
["受任者","受任者",null,null,null,null,"名称",null,null,null,null,{"$f":"IF(AJ38=1,AI39,IF('1入力ｼｰﾄ'!E222=0,\"\",'1入力ｼｰﾄ'!E222))","v":""},null,null,null,null,null,null,null,null,null,null,null,null,null,null,null,null,null,null,null,null,null,null,"受任者廃止S",{"$f":"IF('1入力ｼｰﾄ'!AN516=TRUE,1,0)","v":0}]
[null,null,null,null,null,null,"市区町村\n以降",null,null,null,null,{"$f":"IF(AJ38=1,\"\",IF('1入力ｼｰﾄ'!E238=0,\"\",'1入力ｼｰﾄ'!E238))","v":""}]
[null,null,null,null,null,null,"電話番号",null,null,null,null,{"$f":"IF(AJ38=1,\"\",IF('1入力ｼｰﾄ'!E243=0,\"\",'1入力ｼｰﾄ'!E243))","v":""}]
[null,null,null,null,null,null,"ＦＡＸ",null,null,null,null,{"$f":"IF(AJ38=1,\"\",IF('1入力ｼｰﾄ'!E244=0,\"\",'1入力ｼｰﾄ'!E244))","v":""}]
[null,null,null,null,null,null,"職名",null,null,null,null,{"$f":"IF(AJ38=1,\"\",IF('1入力ｼｰﾄ'!E249=0,\"\",'1入力ｼｰﾄ'!E249))","v":""}]
[null,null,null,null,null,null,"氏名(漢字）",null,null,null,null,{"$f":"IF(AJ38=1,\"\",IF('1入力ｼｰﾄ'!E254=0,\"\",'1入力ｼｰﾄ'!E254))","v":""},null,null,null,null,null,null,null,null,null,null,null,null,null,null,null,null,null,null,null,null,null,null,null,null,null,"大･小分類にエラーがある場合は、出力シート２には出力しない"]
[null,null,null,null,null,null,"(フリガナ）",null,null,null,null,{"$f":"IF(AJ38=1,\"\",IF('1入力ｼｰﾄ'!E259=0,\"\",'1入力ｼｰﾄ'!E259))","v":""},null,null,null,null,null,null,null,null,null,null,null,null,null,null,null,null,null,null,null,null,null,null,null,null,null,"エラーチェック",{"$f":"IF(COUNTIF(AM92:AM347,\"error\")>0,\"error\",\"ok\")","v":"ok"}]
[null,null,null,null,null,null,"生年月日",null,null,null,null,{"$f":"IF(AJ38=1,\"\",IF('1入力ｼｰﾄ'!G263=0,\"\",'1入力ｼｰﾄ'!E263&'1入力ｼｰﾄ'!G263&'1入力ｼｰﾄ'!I263&'1入力ｼｰﾄ'!J263&'1入力ｼｰﾄ'!L263&'1入力ｼｰﾄ'!M263&'1入力ｼｰﾄ'!O263))","v":""},null,null,null,null,null,null,null,null,null,null,null,null,null,null,null,null,null,null,null,null,null,null,null,null,null,"大分類１",{"$f":"IF('1入力ｼｰﾄ'!B592='1入力ｼｰﾄ'!AN$292,\"error\",\"ok\")","v":"ok"}]
[null,null,null,null,null,null,"性別",null,null,null,null,{"$f":"IF(AJ38=1,\"\",IF('1入力ｼｰﾄ'!E267=0,\"\",'1入力ｼｰﾄ'!E267))","v":""},null,null,null,null,null,null,null,null,null,null,null,null,null,null,null,null,null,null,null,null,null,null,null,null,null,"大分類２",{"$f":"IF('1入力ｼｰﾄ'!B594='1入力ｼｰﾄ'!AN$292,\"error\",\"ok\")","v":"ok"}]
["連絡先",null,null,null,null,null,"電話番号",null,null,null,null,{"$f":"IF('1入力ｼｰﾄ'!E273=0,\"\",'1入力ｼｰﾄ'!E273&IF('1入力ｼｰﾄ'!S273=\"\",\"\",\"本社又は受任者と同じです\"))","v":""},null,null,null,null,null,null,null,null,null,null,null,null,null,null,null,null,null,null,null,null,null,null,null,{"$f":"IF('1入力ｼｰﾄ'!AN568=TRUE,\"#\",IF('1入力ｼｰﾄ'!E571=0,\"\",IF('1入力ｼｰﾄ'!S571=\"\",'1入力ｼｰﾄ'!E571,\"\")))","v":""},null,"大分類３",{"$f":"IF('1入力ｼｰﾄ'!B596='1入力ｼｰﾄ'!AN$292,\"error\",\"ok\")","v":"ok"}]
[null,null,null,null,null,null,"ＦＡＸ",null,null,null,null,{"$f":"IF('1入力ｼｰﾄ'!E274=0,\"\",'1入力ｼｰﾄ'!E274&IF('1入力ｼｰﾄ'!S274=\"\",\"\",\"本社又は受任者と同じです\"))","v":""},null,null,null,null,null,null,null,null,null,null,null,null,null,null,null,null,null,null,null,null,null,null,null,{"$f":"IF('1入力ｼｰﾄ'!AN568=TRUE,\"#\",IF('1入力ｼｰﾄ'!E572=0,\"\",IF('1入力ｼｰﾄ'!S572=\"\",'1入力ｼｰﾄ'!E572,\"\")))","v":""},null,"大分類４",{"$f":"IF('1入力ｼｰﾄ'!B598='1入力ｼｰﾄ'!AN$292,\"error\",\"ok\")","v":"ok"}]
[null,null,{"$f":"IF('1入力ｼｰﾄ'!B601=0,\"\",'1入力ｼｰﾄ'!B601&\"　\"&IF('1入力ｼｰﾄ'!B602=\"\",\"\",AI$53))","v":""},null,null,null,null,null,null,null,null,{"$f":"IF('1入力ｼｰﾄ'!I601=0,\"\",'1入力ｼｰﾄ'!I601&'1入力ｼｰﾄ'!L601)","v":""},null,null,null,null,null,{"$f":"IF('1入力ｼｰﾄ'!S601=0,\"\",'1入力ｼｰﾄ'!S601&'1入力ｼｰﾄ'!V601)","v":""},null,null,null,null,null,{"$f":"IF('1入力ｼｰﾄ'!AC601=0,\"\",'1入力ｼｰﾄ'!AC601&'1入力ｼｰﾄ'!AF601)","v":""},null,null,null,null,null,null,null,null,null,null,null,null,null,"小分類２３",{"$f":"IF(OR('1入力ｼｰﾄ'!AF593='1入力ｼｰﾄ'!AN$294,'1入力ｼｰﾄ'!AF593='1入力ｼｰﾄ'!AN$296),\"error\",\"ok\")","v":"ok"}]
[null,"提出書類確認書",null,null,null,null,null,null,null,null,null,null,null,null,"大分類",null,null,"小分類",null,null,{"$f":"IF('1入力ｼｰﾄ'!E96=0,\"\",'1入力ｼｰﾄ'!E96)","v":""},null,null,null,null,null,null,null,null,null,null,null,null,null,null,null,null,"小分類４１",{"$f":"IF(OR('1入力ｼｰﾄ'!L299='1入力ｼｰﾄ'!AN$294,'1入力ｼｰﾄ'!L299='1入力ｼｰﾄ'!AN$296),\"error\",\"ok\")","v":"ok"}]
[null,null,null,null,null,null,null,null,null,null,null,null,null,null,{"$f":"IF('1入力ｼｰﾄ'!B293=0,\"\",LEFT('1入力ｼｰﾄ'!B293,3))","v":""},null,null,{"$f":"IF('1入力ｼｰﾄ'!I293=0,\"\",LEFT('1入力ｼｰﾄ'!I293,3))","v":""},null,null,null,null,null,null,null,null,null,null,null,null,null,null,null,null,null,null,null,"小分類４２",{"$f":"IF(OR('1入力ｼｰﾄ'!V299='1入力ｼｰﾄ'!AN$294,'1入力ｼｰﾄ'!V299='1入力ｼｰﾄ'!AN$296),\"error\",\"ok\")","v":"ok"}]
["　仙台市競争入札参加資格審査申請書の下記提出書類について確認しましたので提出いたします。",null,null,null,null,null,null,null,null,null,null,null,null,null,null,null,null,null,null,null,null,null,null,null,null,null,null,null,null,null,null,null,null,null,null,null,null,"小分類４３",{"$f":"IF(OR('1入力ｼｰﾄ'!AF299='1入力ｼｰﾄ'!AN$294,'1入力ｼｰﾄ'!AF299='1入力ｼｰﾄ'!AN$296),\"error\",\"ok\")","v":"ok"}]
[null,null,null,null,null,null,null,null,null,null,null,null,null,null,null,null,null,null,null,null,null,null,null,null,null,null,null,null,null,null,null,null,null,null,null,null,null,"小分類５１",{"$f":"IF(OR('1入力ｼｰﾄ'!L301='1入力ｼｰﾄ'!AN$294,'1入力ｼｰﾄ'!L301='1入力ｼｰﾄ'!AN$296),\"error\",\"ok\")","v":"ok"}]
[null,null,null,null,null,null,null,null,null,null,null,null,null,null,null,null,null,null,null,null,null,null,null,null,null,null,null,null,null,null,null,null,null,null,null,null,null,"小分類５２",{"$f":"IF(OR('1入力ｼｰﾄ'!V301='1入力ｼｰﾄ'!AN$294,'1入力ｼｰﾄ'!V301='1入力ｼｰﾄ'!AN$296),\"error\",\"ok\")","v":"ok"}]
[null,null,null,null,null,null,null,null,null,null,null,null,null,null,null,"作成担当者署名：",null,null,null,null,null,null,null,null,null,null,null,null,null,null,null,null,null,null,null,null,null,"小分類５３",{"$f":"IF(OR('1入力ｼｰﾄ'!AF301='1入力ｼｰﾄ'!AN$294,'1入力ｼｰﾄ'!AF301='1入力ｼｰﾄ'!AN$296),\"error\",\"ok\")","v":"ok"}]
[null,null,null,null,null,null,null,null,null,null,null,null,null,null,null,null,null,null,null,null,null,null,null,null,null,null,null,null,null,null,null,null,null,null,null,null,null,"小分類６１",{"$f":"IF(OR('1入力ｼｰﾄ'!L303='1入力ｼｰﾄ'!AN$294,'1入力ｼｰﾄ'!L303='1入力ｼｰﾄ'!AN$296),\"error\",\"ok\")","v":"ok"}]
["Ｎｏ","提出書類の名称",null,null,null,null,null,null,null,null,null,null,null,null,"注意事項等",null,null,null,null,null,null,null,null,null,null,null,null,null,null,"作成\n担当者\n確認☑",null,"仙台市\n確認",null,null,null,null,null,"小分類６２",{"$f":"IF(OR('1入力ｼｰﾄ'!V303='1入力ｼｰﾄ'!AN$294,'1入力ｼｰﾄ'!V303='1入力ｼｰﾄ'!AN$296),\"error\",\"ok\")","v":"ok"}]
[1,"提出書類確認書（Excelで出力した様式)",null,null,null,null,null,null,null,null,null,null,null,null,"作成担当者が確認後、署名してください。\n「出力シート1」から出力されます。（Ａ４縦）",null,null,null,null,null,null,null,null,null,null,null,null,null,null,null,null,null,null,null,null,null,null,"小分類６３",{"$f":"IF(OR('1入力ｼｰﾄ'!AF301='1入力ｼｰﾄ'!AN$294,'1入力ｼｰﾄ'!AF301='1入力ｼｰﾄ'!AN$296),\"error\",\"ok\")","v":"ok"}]
[]
[2,"記載内容確認書（Excelで出力した様式)",null,null,null,null,null,null,null,null,null,null,null,null,"作成担当者が確認後、署名してください。\n「出力シート1」から出力されます。（Ａ４縦）"]
[]
[3,"競争入札参加資格審査申請書\n（Excelで出力した様式）",null,null,null,null,null,null,null,null,null,null,null,null,"「出力シート1」から出力されます。（Ａ４縦）"]
[]
[4,"委任状\n（Excelで出力した様式）",null,null,null,null,null,null,null,null,null,null,null,null,"受任者を設置する場合のみ必要です。\n「出力シート1」から出力されます。（Ａ４縦）"]
[]
[]
[5,"使用印鑑届\n（Excelで出力した様式）",null,null,null,null,null,null,null,null,null,null,null,null,"社印（社判、角判）等の、個人（代表者）を特定することができない印は使用できません。\n受任者を設置する場合は、委任状の受任者の使用印を押印してください。\n「出力シート1」から出力されます。（Ａ４縦）"]
[]
[]
[]
[]
[6,"代表者等確認書（Excelで出力した様式)",null,null,null,null,null,null,null,null,null,null,null,null,"「出力シート1」から出力されます。（Ａ４縦）",null,null,null,null,null,null,null,null,null,null,null,null,null,null,null,null,null,null,null,null,null,null,"小分類６３",{"$f":"IF(OR('1入力ｼｰﾄ'!AF303='1入力ｼｰﾄ'!AN$294,'1入力ｼｰﾄ'!AF303='1入力ｼｰﾄ'!AN$296),\"error\",\"ok\")","v":"ok"}]
[]
[7,"仙台市競争入札参加業者登録カード（Excelで出力した様式）\n※Ａ４で出力してＡ３に拡大コピーしても可",null,null,null,null,null,null,null,null,null,null,null,null,"「出力シート2（登録カード）」から2枚出力されますので、すべて提出してください。（Ａ３横　2枚1組）"]
[]
[8,"主要取扱品目（業務）名表\n（Excelで出力した様式）",null,null,null,null,null,null,null,null,null,null,null,null,"「主要取扱品目（業務）名表入力シート（兼出力シート）」から出力されますので、すべて提出してください。（Ａ４横　2枚1組）"]
[]
[9,"清掃・警備業務経歴一覧表\n（Excelで出力した様式）",null,null,null,null,null,null,null,null,null,null,null,null,"「清掃・警備業務経歴入力シート（兼出力シート）」から出力されます（Ａ４横）。\n「117清掃等」(廃棄物収集運搬・処分業も含む)「118警備」で登録を希望される方は提出してください。（実績なしの場合は「なし」と記入してください）"]
[]
[10,"封筒表紙（Excelで出力した様式）\n※角２封筒に貼ってください。書類保管に使用しますので、切手は不要です。",null,null,null,null,null,null,null,null,null,null,null,null,"封筒（角２）に貼り、二つ折りにして同封してください。"]
[]
[11,"郵送用宛名（Excelで出力した様式）",null,null,null,null,null,null,null,null,null,null,null,null,"必要に応じて申請書類を郵送する封筒（角２）に貼ってください。"]
[]
[12,"印鑑証明書(原本）",null,null,null,null,null,null,null,null,null,null,null,null,"法人（代表者）は法務局発行の証明書\n個人（本人）は市区町村長発行の証明書\n(申請前3ヶ月以内に発行の最新のもの)"]
[]
[]
[13,"履歴事項全部証明書（本店分）（原本）\n身元証明書（原本）",null,null,null,null,null,null,null,null,null,null,null,null,"法人は法務局発行の履歴事項全部証明書\n個人は市区町村長発行の身元(身分）証明書\n(申請前3ヶ月以内に発行の最新のもの)"]
[]
[]
[]
[14,"消費税及び地方消費税について未納税額のない証明（写し可）",null,null,null,null,null,null,null,null,null,null,null,null,"本社所在地所管の税務署発行の消費税及び地方消費税に関する「納税証明書(その３)・(その３の２)・(その３の３)」のうちのいずれか１つ\n(申請前3ヶ月以内に発行の最新のもの)"]
[]
[]
[]
[14,"ＩＳＯ9000・14000シリーズの認証登録証\n(写し）",null,null,null,null,null,null,null,null,null,null,null,null,"ＩＳＯ9000・14000シリーズの認証を取得している場合のみ、有効期間内の認証登録証の写しを提出してください。"]
[]
[]
[15,"財務諸表(直前2カ年）（写し）",null,null,null,null,null,null,null,null,null,null,null,null,"法人は貸借対照表及び損益計算書\n個人は収支計算書"]
[]
[16,"許可（登録）証明書（写し）",null,null,null,null,null,null,null,null,null,null,null,null,"営業に関し法令上許可・登録を必要とする業種について申請する方は、その許可（登録)証の写しを提出してください。"]
[]
[]
[17,"障害者雇用状況報告書（写し）",null,null,null,null,null,null,null,null,null,null,null,null,"常用雇用者50人以上の事業者が対象。所管の公共職業安定所に、6月1日現在の状況を報告した、最新の報告書の写しを提出してください。"]
[]
[]
[]
[17,"継続申請案内はがきの写し",null,null,null,null,null,null,null,null,null,null,null,null,"継続申請の方のみ提出してください。お送りしたはがきの宛名面をコピーしてください。（A４）"]
[]
[]
[null,null,null,null,null,null,null,null,null,null,null,null,null,null,null,null,null,null,null,null,null,null,null,null,null,{"$f":"'1入力ｼｰﾄ'!N316","v":""},null,null,null,{"$f":"'1入力ｼｰﾄ'!U316","v":""}]
[]
[]
["〔物　　品〕"]
[]
["令和5・6・7年度仙台市競争入札参加資格審査申請書"]
[]
[null,null,null,null,null,null,null,null,null,null,null,null,null,null,null,null,null,null,null,null,null,null,null,{"$f":"AJ7","v":""}]
[]
["（あて先）"]
["仙台市長"]
["仙台市水道事業管理者"]
["仙台市交通事業管理者"]
["仙台市ガス事業管理者",null,null,null,null,null,null,null,null,null,null,null,null,null,null,null,null,{"$f":"IF(L24=\"\",\"\",\"(登)\"&IF(LEFT(L24,2)=\"04\",L25,MID(L24,4,4)&L25))","v":""}]
["仙台市病院事業管理者"]
[]
[null,null,null,null,null,null,null,null,null,null,null,null,null,null,null,null,null,{"$f":"IF(LEFT(L20,2)=\"04\",L21,MID(L20,4,4)&L21)","v":""}]
[null,null,null,null,null,null,null,null,null,null,null,"申請人住所"]
[]
[null,null,null,null,null,null,null,null,null,null,null,"名称又は商号",null,null,null,null,null,{"$f":"L12","v":""}]
[]
[null,null,null,null,null,null,null,null,null,null,null,null,null,null,"フリガナ",null,null,{"$f":"L16","v":""}]
[null,null,null,null,null,null,null,null,null,null,null,"代表者職氏名",null,null,null,null,null,{"$f":"L14&\" \"&L15","v":" "}]
[null,null,null,null,null,null,null,null,null,null,null,"（生年月日",null,null,null,null,null,{"$f":"IF('1入力ｼｰﾄ'!E120=0,\"\",'1入力ｼｰﾄ'!E120)","v":""},null,{"$f":"IF('1入力ｼｰﾄ'!G120=0,\"\",'1入力ｼｰﾄ'!G120)","v":""},null,"年",{"$f":"IF('1入力ｼｰﾄ'!J120=0,\"\",'1入力ｼｰﾄ'!J120)","v":""},null,"月",{"$f":"IF('1入力ｼｰﾄ'!M120=0,\"\",'1入力ｼｰﾄ'!M120)","v":""},null,"日）"]
[null,null,null,null,null,null,null,null,null,null,null,"（性別",null,null,null,null,null,{"$f":"IF('1入力ｼｰﾄ'!E124=0,\"\",'1入力ｼｰﾄ'!E124)","v":""},null,"）"]
[]
[]
[null,null,"令和5・6・7年度において仙台市が行う物品の売買、その他の契約に係る入札に参加した"]
[null,"　いので、関係書類を添えて入札参加資格の審査を申請します。また併せて、下記の事項について"]
[null,"　誓約し、同意します。"]
[]
[]
[null,"１．誓約事項"]
[]
[null,null,"（1）　本申請書及び添付書類のすべての記載事項は事実と相違ないことを誓約します。"]
[]
[null,null,"（2）　いかなる公共団体の入札においても「私的独占の禁止及び公正取引の確保に関する"]
[null,null,"　　　法律（独占禁止法）」に抵触する行為は行わないとともに、今後とも関係法令を遵守す"]
[null,null,"　　　ることをあらためて誓約します。"]
[]
[null,null,"（3）　本申請が法人その他の団体による申請の場合は、当該団体の役員（業務を執行する"]
[null,null,"　　　社員、取締役、執行役又はこれらに準ずる者、及びこれらの者と同等以上の支配力を"]
[null,null,"　　　当該団体に対して有すると認められる者）が暴力団員（暴力団員でなくなった日から"]
[null,null,"　　　５年を経過しない者を含む。）でないことを誓約します。"]
[]
[]
[null,"２．同意事項"]
[null,null,"（1）　私（代表者個人）が暴力団等との関係を有しないことを確認するため、本申請書に添"]
[null,null,"　　　付する「競争入札参加資格審査申請書 記載内容確認書」に記載された私に関する個"]
[null,null,"　　　人情報を、仙台市が宮城県警察本部に提供して照会することに同意します。"]
[]
[null,null,"（2）　私（法人その他の団体による申請の場合は当該団体、個人による申請の場合は当該"]
[null,null,"　　　個人）に関する仙台市税納付状況(税目・税額・申告の有無等）について、仙台市財政"]
[null,null,"　　　局財政部契約課が税務担当課に対して照会することに同意します。"]
[]
["作成担当者"]
["所　属",null,{"$f":"IF('1入力ｼｰﾄ'!E60=0,\"\",'1入力ｼｰﾄ'!E60)","v":""},null,null,null,null,"氏　名",null,{"$f":"IF('1入力ｼｰﾄ'!E70=0,\"\",'1入力ｼｰﾄ'!E70)","v":""},null,null,null,null,null,null,null,"電話\n番号",null,{"$f":"IF('1入力ｼｰﾄ'!E75=0,\"\",'1入力ｼｰﾄ'!E75)","v":""},null,null,null,null,null,null,null,"仙台市使用欄"]
[null,null,null,null,null,null,null,null,null,{"$f":"IF('1入力ｼｰﾄ'!E65=0,\"\",'1入力ｼｰﾄ'!E65)","v":""},null,null,null,null,null,null,null,null,null,null,null,null,null,null,null,null,null,"受付年月日"]
[]
[null,null,null,null,null,null,null,null,null,null,null,null,null,null,null,null,null,null,null,null,null,null,null,null,null,null,null,null,null,null,null,null,null,"㊞"]
[null,null,null,null,null,null,null,null,null,null,null,null,null,null,null,null,null,{"$f":"'1入力ｼｰﾄ'!N316","v":""},null,null,null,{"$f":"'1入力ｼｰﾄ'!U316","v":""}]
[null,null,null,null,null,null,null,null,null,null,null,null,null,null,null,null,null,null,null,null,null,null,null,null,null,{"$f":"'1入力ｼｰﾄ'!N316","v":""},null,null,null,{"$f":"'1入力ｼｰﾄ'!U316","v":""}]
["委　　　任　　　状"]
[]
[]
[null,null,null,"　私は、下記受任者を代理人と定め、仙台市競争入札参加資格の有効期間における"]
[]
[null,null,null,"仙台市との下記事項に関する権限を委任します。"]
[]
[]
[null,"記"]
[]
[null,null,null,"１．見積り、入札及び契約の締結に関すること。（契約の変更、解約に関することを含む。）"]
[]
[null,null,null,"２．復代理人を選任すること。"]
[]
[null,null,null,"３．契約代金を請求及び受領すること。"]
[]
[null,null,null,"４．契約違反又は債務保証に基づいて生ずる債務を履行すること。"]
[]
[null,null,null,"５．共同企業体の結成及び結成後の共同企業体に関する上記各項の権限。"]
[]
[]
[null,null,{"$f":"AJ7","v":""}]
[]
[null,null,null,"（あて先）"]
[null,null,null,null,"仙台市長"]
[null,null,null,null,"仙台市水道事業管理者"]
[null,null,null,null,"仙台市交通事業管理者"]
[null,null,null,null,"仙台市ガス事業管理者"]
[null,null,null,null,"仙台市病院事業管理者"]
[]
[]
[null,null,"委任者"]
[null,null,null,null,null,null,null,null,null,null,null,null,{"$f":"IF(L45=\"\",AI251,R173)","v":"受任者を設置しませんので、提出の必要はありません。"},null,null,null,null,null,null,null,null,null,null,null,null,null,null,null,null,null,null,null,null,null,"受任者を設置しませんので、提出の必要はありません。"]
[null,null,null,"本店・本社所在地"]
[]
[null,null,null,"商号又は名称",null,null,null,null,null,null,null,null,{"$f":"IF(L45=\"\",\"\",R176)","v":""}]
[]
[null,null,null,"代表者職氏名",null,null,null,null,null,null,null,null,{"$f":"IF(L45=\"\",\"\",R179)","v":""}]
[]
[]
[]
[]
[]
[null,null,"受任者"]
[null,null,null,null,null,null,null,null,null,null,null,null,{"$f":"IF(L45=\"\",\"\",IF(LEFT(L40,2)=\"04\",L41,MID(L40,4,4)&L41))","v":""}]
[null,null,null,"支店・営業所等所在地"]
[]
[null,null,null,"商号又は名称",null,null,null,null,null,null,null,null,{"$f":"IF(L45=\"\",\"\",R176)","v":""}]
[]
[null,null,null,"支店・営業所名称",null,null,null,null,null,null,null,null,{"$f":"IF(L45=\"\",\"\",L38)","v":""}]
[null,null,null,null,null,null,"フリガナ",null,null,null,null,null,{"$f":"IF(L45=\"\",\"\",L46)","v":""}]
[null,null,null,"受任者職氏名",null,null,null,null,null,null,null,null,{"$f":"IF(L45=\"\",\"\",L44&\"　\"&L45)","v":""}]
[null,null,null,null,"（生年月日",null,null,null,null,null,null,null,{"$f":"IF('1入力ｼｰﾄ'!E263=0,\"\",'1入力ｼｰﾄ'!E263)","v":""},null,{"$f":"IF('1入力ｼｰﾄ'!G263=0,\"\",'1入力ｼｰﾄ'!G263)","v":""},null,"年",{"$f":"IF('1入力ｼｰﾄ'!J263=0,\"\",'1入力ｼｰﾄ'!J263)","v":""},null,"月",{"$f":"IF('1入力ｼｰﾄ'!M263=0,\"\",'1入力ｼｰﾄ'!M263)","v":""},null,"日）"]
[null,null,null,null,null,"（性別",null,null,null,null,null,null,{"$f":"IF('1入力ｼｰﾄ'!E267=0,\"\",'1入力ｼｰﾄ'!E267)","v":""},null,"）"]
[]
[null,null," 【受任者同意事項】　私（受任者個人）が暴力団等との関係を有しないことを確認するため、"]
[null,null," 上記の私に関する個人情報を、仙台市が宮城県警察本部に提供して照会することに同意"]
[null,null," します。"]
[]
[null,null,null,null,null,null,null,null,null,null,null,null,null,null,null,null,null,null,null,null,{"$f":"IF(L20=\"\",\"\",IF(LEFT(L20,2)=\"04\",\"県内\",\"県外\"))","v":""},null,null,"大分類",null,null,"小分類",null,null,{"$f":"LEFT(L13,2)","v":""}]
[null,null,null,null,null,null,null,null,null,null,null,null,null,null,null,null,null,null,null,null,null,null,null,{"$f":"LEFT(C53,3)","v":""},null,null,{"$f":"LEFT(L53,3)","v":""}]
[]
[]
[]
["使　用　印　鑑　届"]
[]
[null,null,{"$f":"AJ7","v":""}]
[]
[null,null,null,"（あて先）"]
[null,null,null,null,"仙台市長"]
[null,null,null,null,"仙台市水道事業管理者"]
[null,null,null,null,"仙台市交通事業管理者"]
[null,null,null,null,"仙台市ガス事業管理者"]
[null,null,null,null,"仙台市病院事業管理者"]
[]
[null,null,null,null,null,null,null,null,null,null,null,null,null,null,null,null,null,{"$f":"R173","v":""}]
[null,null,null,null,null,null,null,null,null,null,null,"申請人住所"]
[]
[null,null,null,null,null,null,null,null,null,null,null,"名称又は商号",null,null,null,null,null,{"$f":"R176","v":""}]
[]
[]
[null,null,null,null,null,null,null,null,null,null,null,"代表者職氏名",null,null,null,null,null,{"$f":"R179","v":" "}]
[]
[]
[]
[]
[null,null,null,"下記印鑑を、入札、見積り、契約の締結、代金の請求及び受領、その他契約に関し"]
[]
[null,null,"使用しますので届け出ます。"]
[]
[]
[null,null,null,null,null,null,null,null,null,"使　用　印　鑑"]
[]
[]
[]
[]
[]
[]
[]
[]
[]
[]
[]
[]
[]
[]
[]
[]
[null,null,"注意事項"]
[null,null,"１　入札書、見積書、契約書、代金請求書及び領収書等に使用する印鑑を所定欄に鮮明に"]
[null,null,null,"押印してください。"]
[null,null,"２　入札、契約等の権限を代理人に委任する場合は、委任状の受任者の使用印を所定欄に"]
[null,null,null,"押印してください。"]
[null,null,"３　社印（社判・角判)等の、個人（代表者）を特定することができない印は使用できません。"]
[null,null,"４　実印は、印鑑証明書と同じ印を押印してください。"]
[]
[]
[]
[null,null,null,null,null,null,null,null,null,null,null,null,null,null,null,null,null,null,null,null,null,null,null,null,null,{"$f":"'1入力ｼｰﾄ'!N316","v":""},null,null,null,{"$f":"'1入力ｼｰﾄ'!U316","v":""}]
[]
[null,null,null,null,null,null,null,null,null,null,null,null,null,null,"物　品"]
[null,"(仙台市保管用）"]
[]
[null,"申請関係書類保管用封筒"]
[]
[{"$f":"IF(L20=\"\",\"\",IF(LEFT(L20,2)=\"04\",\"県内\",\"県外\"))","v":""},null,null,null,null,null,null,{"$f":"L8","v":"新規"},null,null,null,null,null,null,"大　分　類",null,null,null,null,null,null,"小　分　類",null,null,null,null,null,null,{"$f":"AD278","v":""}]
[null,null,null,null,null,null,null,null,null,null,null,null,null,null,{"$f":"X279","v":""},null,null,null,null,null,null,{"$f":"AA279","v":""}]
[]
[]
[]
[]
[]
[]
[]
["競争入札参加資格審査申請用封筒表紙"]
[]
[]
[]
[]
[]
[]
[null,"フリガナ",null,null,null,null,{"$f":"L13","v":""}]
[]
[null,"会社名",null,null,null,null,{"$f":"L12","v":""}]
[]
[]
[]
[null,"所在地\n（本社・本店）",null,null,null,null,{"$f":"R173","v":""}]
[]
[]
[]
[]
[]
[]
[]
[null,"次の注意事項をよく読んでください。"]
[]
[null,{"$f":"IF(AJ8=10,AJ378,IF(AJ8=12,AJ379,\"\"))","v":"新規申請の方"}]
[]
[null,null,null,null,null,null,null,null,null,null,null,null,null,null,null,null,null,null,null,null,null,null,null,null,null,null,null,null,null,null,null,null,null,null,null,"新規申請の方"]
[null,null,"角2サイズ（A4が入るサイズ）の封筒を2通用意してください。",null,null,null,null,null,null,null,null,null,null,null,null,null,null,null,null,null,null,null,null,null,null,null,null,null,null,null,null,null,null,null,null,"継続申請の方"]
[null,null,null,null,null,null,null,null,null,null,null,null,null,null,null,null,null,null,null,null,null,null,null,null,null,null,null,null,null,null,null,null,null,null,null,"角2サイズ（A4が入るサイズ）の封筒を1通用意してください。"]
[null,null,"1通は、郵送用宛名を貼り、郵送用として使用してください。",null,null,null,null,null,null,null,null,null,null,null,null,null,null,null,null,null,null,null,null,null,null,null,null,null,null,null,null,null,null,null,null,"この表紙を用意した角2サイズの封筒に貼り、申請関係書類を入れて持参してください。"]
[]
[null,null,"もう1通にこの表紙を貼り、二つ折りにして申請関係書類に重ねて郵送用封筒に入れてください。",null,null,null,null,null,null,null,null,null,null,null,null,null,null,null,null,null,null,null,null,null,null,null,null,null,null,null,null,null,null,null,null,"角2サイズ（A4が入るサイズ）の封筒を2通用意してください。"]
[null,null,null,null,null,null,null,null,null,null,null,null,null,null,null,null,null,null,null,null,null,null,null,null,null,null,null,null,null,null,null,null,null,null,null,"1通は、郵送用宛名を貼り、郵送用として使用してください。"]
[null,null,null,null,null,null,null,null,null,null,null,null,null,null,null,null,null,null,null,null,null,null,null,null,null,null,null,null,null,null,null,null,null,null,null,"もう1通にこの表紙を貼り、二つ折りにして申請関係書類に重ねて郵送用封筒に入れてください。"]
[]
[]
[]
[]
[]
[]
[]
[]
[null,null,null,null,null,null,null,null,null,null,null,null,null,null,null,null,null,null,null,null,null,null,null,"(仙台市保管用）"]
[]
[null,null,null,null,null,null,null,null,null,null,null,null,null,null,null,null,null,null,null,null,null,null,null,"申請関係書類保管用封筒"]
[null,null,null,null,null,null,null,null,null,null,null,null,null,null,null,null,null,null,null,null,null,null,null,null,null,{"$f":"'1入力ｼｰﾄ'!N316","v":""},null,null,null,{"$f":"'1入力ｼｰﾄ'!U316","v":""}]
[]
[null,null,null,null,null,null,null,null,null,null,null,null,null,null,null,null,null,null,null,null,null,null,null,null,null,null,null,null,null,null,null,null,null,null,null,"【新規申請用】"]
[null,null,null,null,null,null,null,null,null,null,null,null,null,null,null,null,null,null,null,null,null,null,null,null,null,null,null,null,null,null,null,null,null,null,null,"競争入札参加資格審査申請書受領証（控）"]
[null,null,null,null,null,null,null,null,null,null,null,null,null,null,null,null,null,null,null,null,null,null,null,null,null,null,null,null,null,null,null,null,null,null,null,"競争入札参加資格審査申請書受領証"]
[null,null,null,null,null,null,null,null,null,null,null,null,null,null,null,null,null,null,null,null,null,null,null,null,null,null,null,null,null,null,null,null,null,null,null,"申請者"]
[null,null,null,null,null,null,null,null,null,null,null,null,null,null,null,null,null,null,null,null,null,null,null,null,null,null,null,null,null,null,null,null,null,null,null,"(本店・本社）"]
[]
[]
[]
[]
[]
[]
[null,null,null,null,null,null,null,null,null,null,null,null,null,null,null,null,null,null,null,null,null,null,null,null,null,null,null,null,null,null,null,null,null,null,null,"申請種別　物品関係"]
[]
[null,null,null,null,null,null,null,null,null,null,null,null,null,null,null,null,null,null,null,null,null,null,null,null,null,null,null,null,null,null,null,null,null,null,null,"令和2・3・4年度仙台市競争入札参加資格"]
[]
[null,null,null,null,null,null,null,null,null,null,null,null,null,null,null,null,null,null,null,null,null,null,null,null,null,null,null,null,null,null,null,null,null,null,null,"審査申請書を受領いたしました。"]
[]
[null,null,null,null,null,null,null,null,null,null,null,null,null,null,null,null,null,null,null,null,null,null,null,null,null,null,null,null,null,null,null,null,null,null,null,"申請書類を審査のうえ、競争入札参加資格を"]
[]
[null,null,null,null,null,null,null,null,null,null,null,null,null,null,null,null,null,null,null,null,null,null,null,null,null,null,null,null,null,null,null,null,null,null,null,"有すると認められた方には、後日通知いたします。"]
[]
[]
[null,null,null,null,null,null,null,null,null,null,null,null,null,null,null,null,null,null,null,null,null,null,null,null,null,null,null,null,null,null,null,null,null,null,null,"令和　　　年　　　月　　　日"]
[]
[null,null,null,null,null,null,null,null,null,null,null,null,null,null,null,null,null,null,null,null,null,null,null,null,null,null,null,null,null,null,null,null,null,null,null,"仙台市財政局財政部契約課"]
[]
["※郵便用宛名は必要に応じてご利用ください※",null,null,null,null,null,null,null,null,null,null,null,null,null,null,null,null,null,null,null,null,null,null,null,null,null,null,null,null,null,null,null,null,null,null,"受付担当　　　　　　　　　　　　　　　㊞"]
[]
[]
[null,null,null,null,"き",null,null,null,null,"り",null,null,null,null,"と",null,null,null,null,"り",null,null,null,null,"せ",null,null,null,null,"ん"]
[null,null,null,null,null,null,null,null,null,null,null,null,null,null,null,null,null,null,null,null,null,null,null,null,null,null,null,null,"（郵送用宛名）"]
[null,null,null,null,null,"配　達　証　明　付　書　留　郵　便",null,null,null,null,null,null,null,null,null,null,null,null,null,null,null,null,null,null,null,null,null,null,null,null,null,null,null,null,null,"配　達　証　明　付　書　留　郵　便"]
[]
[null,null,null,null,null,null,null,null,null,null,null,null,null,null,null,null,null,null,null,null,null,null,null,null,null,null,null,null,null,null,null,null,null,null,null,null,"（郵送用宛名）"]
[]
["送付先",null,null,"〒９８０－８６７１",null,null,null,null,null,null,null,null,null,null,null,null,null,null,null,null,null,null,null,null,null,null,null,null,null,null,null,null,null,null,null,"送付先","〒９８０－８６７１"]
[]
[null,null,null,"仙台市青葉区国分町三丁目７－１",null,null,null,null,null,null,null,null,null,null,null,null,null,null,null,null,null,null,null,null,null,null,null,null,null,null,null,null,null,null,null,"仙台市青葉区国分町三丁目７－１"]
[]
[null,null,null,"仙台市役所",null,null,null,null,null,null,null,null,null,null,null,null,null,null,null,null,null,null,null,null,null,null,null,null,null,null,null,null,null,null,null,"仙台市役所"]
[]
[null,null,null,"財政局財政部契約課物品契約係　　行",null,null,null,null,null,null,null,null,null,null,null,null,null,null,null,null,null,null,null,null,null,null,null,null,null,null,null,null,null,null,null,"財政局財政部契約課物品契約係　　行"]
[]
[]
[]
[]
[]
[]
[]
[null,null,null,"新規申請用　　競争入札参加資格審査申請書在中",null,null,null,null,null,null,null,null,null,null,null,null,null,null,null,null,null,null,null,null,null,null,null,null,null,null,null,null,null,null,null,"継続申請用　　競争入札参加資格審査申請書在中"]
[]
[]
[null,null,null,"申請者",null,null,null,{"$f":"IF(AJ8=12,L12,\"\")","v":""}]
[]
[null,null,null,null,null,null,null,{"$f":"R176","v":""}]
[]
[null,null,null,null,null,null,null,null,null,null,null,null,{"$f":"IF(AJ8=12,L9,\"\")","v":""}]

{"sheet":"出力ｼｰﾄ2(登録ｶｰﾄﾞ）","index":7,"n_rows":114,"n_cols":66,"rows_kept":114,"cut":false,"hidden":false,"merged":[[57,62,57,64],[113,58,113,61],[113,62,113,64],[112,12,112,13],[95,15,95,18],[108,15,108,18],[104,12,104,13],[64,36,64,62],[141,1,143,5],[115,1,115,4],[110,15,110,18],[111,15,111,18],[135,1,140,5],[141,6,143,8],[113,3,113,4],[127,1,129,5],[57,58,57,61],[124,1,126,5],[95,3,95,4],[94,6,94,9],[96,3,96,4],[91,3,91,4],[101,12,101,13],[103,12,103,13],[170,62,170,64],[137,9,137,10],[121,6,123,8],[118,1,123,5],[112,3,112,4],[110,3,110,4],[111,6,111,9],[91,6,91,9],[92,3,92,4],[170,6,170,9],[109,3,109,4],[105,3,105,4],[170,58,170,61],[115,11,115,14],[115,9,115,10],[117,1,117,5],[110,6,110,9],[111,3,111,4],[134,1,134,5],[144,1,146,5],[107,3,107,4],[98,3,98,4],[109,12,109,13],[107,12,107,13],[108,3,108,4],[101,3,101,4],[104,3,104,4],[100,3,100,4],[103,6,103,9],[100,6,100,9],[103,3,103,4],[99,6,99,9],[102,6,102,9],[102,3,102,4],[99,3,99,4],[67,4,68,5],[67,6,68,8],[69,9,70,10],[62,1,63,4],[47,9,49,10],[65,1,76,3],[73,4,74,5],[62,36,63,62],[106,12,106,13],[106,3,106,4],[90,6,90,9],[88,2,89,5],[75,4,76,5],[69,4,70,5],[71,4,72,5],[73,6,74,8],[75,9,76,10],[71,9,72,10],[97,3,97,4],[95,6,95,9],[96,6,96,9],[93,6,93,9],[93,3,93,4],[94,3,94,4],[28,23,30,24],[35,2,40,6],[53,6,55,8],[41,2,46,6],[41,9,43,10],[7,9,9,10],[65,4,66,5],[53,1,55,5],[62,9,63,10],[35,1,49,1],[49,7,49,8],[47,2,49,6],[46,7,46,8],[65,9,66,13],[55,9,55,10],[65,6,66,8],[25,9,27,10],[13,11,15,12],[30,7,30,8],[7,1,30,1],[66,14,66,16],[3,24,4,27],[25,23,27,24],[4,9,4,10],[18,7,18,8],[19,9,21,10],[17,14,18,14],[16,19,18,21],[21,7,21,8],[3,11,4,14],[27,7,27,8],[22,9,24,10],[13,7,15,10],[3,1,4,4],[7,2,15,6],[16,9,18,10],[10,9,12,10],[9,7,9,8],[12,7,12,8],[22,7,24,8],[16,2,24,6],[25,2,30,6],[22,41,24,42],[28,37,30,38],[31,41,31,47],[3,56,4,60],[3,38,4,40],[3,48,4,51],[10,51,12,52],[25,28,27,29],[38,28,40,29],[13,45,15,47],[13,49,15,51],[25,36,27,37],[25,42,27,43],[3,32,4,35],[13,28,15,29],[67,9,68,10],[62,11,63,14],[38,11,40,12],[38,7,40,10],[43,7,43,8],[42,14,43,14],[35,9,37,10],[37,7,37,8],[44,9,46,10],[53,26,55,28],[16,24,18,26],[107,6,107,9],[138,6,140,8],[41,24,43,26],[69,6,70,8],[66,17,66,19],[41,19,43,21],[66,20,66,22],[65,14,65,22],[28,9,30,10],[71,6,72,8],[96,12,96,13],[97,12,97,13],[81,8,81,57],[92,6,92,9],[97,6,97,9],[75,6,76,8],[95,12,95,13],[73,9,74,10],[47,41,49,42],[111,12,111,13],[138,41,140,43],[100,15,100,18],[106,15,106,18],[121,34,121,40],[121,41,123,43],[138,34,138,40],[138,31,140,33],[113,12,113,13],[110,12,110,13],[113,15,113,18],[105,12,105,13],[146,9,146,10],[124,6,126,8],[143,9,143,10],[135,6,137,8],[112,6,112,9],[129,9,129,10],[126,9,126,10],[113,6,113,9],[123,9,123,10],[140,9,140,10],[144,6,146,8],[127,6,129,8],[98,6,98,9],[98,12,98,13],[101,6,101,9],[98,15,98,18],[100,12,100,13],[102,15,102,18],[105,15,105,18],[104,15,104,18],[121,31,123,33],[101,15,101,18],[108,12,108,13],[99,15,99,18],[102,12,102,13],[109,15,109,18],[118,6,120,8],[120,9,120,10],[108,6,108,9],[105,6,105,9],[112,15,112,18],[106,6,106,9],[109,6,109,9],[107,15,107,18],[103,15,103,18],[104,6,104,9],[99,12,99,13],[91,12,91,13],[97,15,97,18],[93,15,93,18],[88,15,89,19],[88,11,89,14],[93,12,93,13],[94,12,94,13],[94,15,94,18],[91,15,91,18],[92,15,92,18],[96,15,96,18],[92,12,92,13],[82,3,83,3],[84,3,85,3],[82,4,83,7],[84,4,85,7],[82,1,85,2],[90,15,90,18],[87,2,87,19],[90,12,90,13],[88,6,89,10],[90,3,90,4]]}
[]
[null,null,null,null,null,null,null,null,null,null,null,null,null,null,null,null,null,null,null,null,null,null,null,null,null,null,null,null,null,null,null,null,null,null,null,null,null,null,null,null,null,null,null,null,null,null,null,null,null,null,null,null,null,null,null,null,null,null,null,null,null,"Ｎｏ．１"]
[]
[null,"受付番号",null,null,null,null,null,null,null,null,null,"業者番号",null,null,null,null,null,null,null,null,null,null,null,null,"地域コード",null,null,null,null,null,null,null,"届出区分",null,null,null,null,null,"申請日",null,null,null,null,null,null,null,null,null,"一連番号",null,null,null,null,null,null,null,"業者登録区分"]
[null,null,null,null,null,{"$f":"MID('1入力ｼｰﾄ'!$E52,COLUMN()-5,1)","v":""},{"$f":"MID('1入力ｼｰﾄ'!$E52,COLUMN()-5,1)","v":""},{"$f":"MID('1入力ｼｰﾄ'!$E52,COLUMN()-5,1)","v":""},{"$f":"MID('1入力ｼｰﾄ'!$E52,COLUMN()-5,1)","v":""},"01",null,null,null,null,null,{"$f":"MID(出力ｼｰﾄ1!$L9,COLUMN()-15,1)","v":""},{"$f":"MID(出力ｼｰﾄ1!$L9,COLUMN()-15,1)","v":""},{"$f":"MID(出力ｼｰﾄ1!$L9,COLUMN()-15,1)","v":""},{"$f":"MID(出力ｼｰﾄ1!$L9,COLUMN()-15,1)","v":""},{"$f":"MID(出力ｼｰﾄ1!$L9,COLUMN()-15,1)","v":""},{"$f":"MID(出力ｼｰﾄ1!$L9,COLUMN()-15,1)","v":""},{"$f":"MID(出力ｼｰﾄ1!$L9,COLUMN()-15,1)","v":""},{"$f":"MID(出力ｼｰﾄ1!$L9,COLUMN()-15,1)","v":""},{"$f":"MID(出力ｼｰﾄ1!$L9,COLUMN()-15,1)","v":""},null,null,null,null,{"$f":"MID(出力ｼｰﾄ1!$AJ24,COLUMN()-28,1)","v":""},{"$f":"MID(出力ｼｰﾄ1!$AJ24,COLUMN()-28,1)","v":""},{"$f":"MID(出力ｼｰﾄ1!$AJ24,COLUMN()-28,1)","v":""},{"$f":"MID(出力ｼｰﾄ1!$AJ24,COLUMN()-28,1)","v":""},null,null,null,null,0,{"$f":"MID(出力ｼｰﾄ1!$AJ8,COLUMN()-36,1)","v":"0"},null,null,null,"R",{"$f":"MID('1入力ｼｰﾄ'!$G41,COLUMN()-42,1)","v":""},{"$f":"MID('1入力ｼｰﾄ'!$G41,COLUMN()-42,1)","v":""},{"$f":"MID('1入力ｼｰﾄ'!$J41,COLUMN()-44,1)","v":""},{"$f":"MID('1入力ｼｰﾄ'!$J41,COLUMN()-44,1)","v":""},{"$f":"MID('1入力ｼｰﾄ'!$M41,COLUMN()-46,1)","v":""},{"$f":"MID('1入力ｼｰﾄ'!$M41,COLUMN()-46,1)","v":""},null,null,null,null,{"$f":"MID('1入力ｼｰﾄ'!$E52,COLUMN()-52,1)","v":""},{"$f":"MID('1入力ｼｰﾄ'!$E52,COLUMN()-52,1)","v":""},{"$f":"MID('1入力ｼｰﾄ'!$E52,COLUMN()-52,1)","v":""},{"$f":"MID('1入力ｼｰﾄ'!$E52,COLUMN()-52,1)","v":""},null,null,null,null,null,{"$f":"IF('1入力ｼｰﾄ'!E46=\"新規\",0,\" \")","v":0},{"$f":"IF('1入力ｼｰﾄ'!E46=\"新規\",1,\" \")","v":1}]
[]
[null,null,null,null,null,null,null,null,null,null,null,null,null,null,null,null,null,null,null,null,null,null,null,null,null,null,null,null,null,null,null,null,null,null,null,null,null,null,null,null,null,null,null,{"$f":"MID('1入力ｼｰﾄ'!$G41,COLUMN()-26,1)","v":""}]
[null,"申　　　請　　　者","（本店)\n\n名称等",null,null,null,null,null,null,"カナ\n名称"]
[]
[null,null,null,null,null,null,null,"02",null,null,null,{"$f":"MID('1入力ｼｰﾄ'!$E101,COLUMN()-11,1)","v":""},{"$f":"MID('1入力ｼｰﾄ'!$E101,COLUMN()-11,1)","v":""},{"$f":"MID('1入力ｼｰﾄ'!$E101,COLUMN()-11,1)","v":""},{"$f":"MID('1入力ｼｰﾄ'!$E101,COLUMN()-11,1)","v":""},{"$f":"MID('1入力ｼｰﾄ'!$E101,COLUMN()-11,1)","v":""},{"$f":"MID('1入力ｼｰﾄ'!$E101,COLUMN()-11,1)","v":""},{"$f":"MID('1入力ｼｰﾄ'!$E101,COLUMN()-11,1)","v":""},{"$f":"MID('1入力ｼｰﾄ'!$E101,COLUMN()-11,1)","v":""},{"$f":"MID('1入力ｼｰﾄ'!$E101,COLUMN()-11,1)","v":""},{"$f":"MID('1入力ｼｰﾄ'!$E101,COLUMN()-11,1)","v":""},{"$f":"MID('1入力ｼｰﾄ'!$E101,COLUMN()-11,1)","v":""},{"$f":"MID('1入力ｼｰﾄ'!$E101,COLUMN()-11,1)","v":""},{"$f":"MID('1入力ｼｰﾄ'!$E101,COLUMN()-11,1)","v":""},{"$f":"MID('1入力ｼｰﾄ'!$E101,COLUMN()-11,1)","v":""},{"$f":"MID('1入力ｼｰﾄ'!$E101,COLUMN()-11,1)","v":""},{"$f":"MID('1入力ｼｰﾄ'!$E101,COLUMN()-11,1)","v":""},{"$f":"MID('1入力ｼｰﾄ'!$E101,COLUMN()-11,1)","v":""},{"$f":"MID('1入力ｼｰﾄ'!$E101,COLUMN()-11,1)","v":""},{"$f":"MID('1入力ｼｰﾄ'!$E101,COLUMN()-11,1)","v":""},{"$f":"MID('1入力ｼｰﾄ'!$E101,COLUMN()-11,1)","v":""},{"$f":"MID('1入力ｼｰﾄ'!$E101,COLUMN()-11,1)","v":""},{"$f":"MID('1入力ｼｰﾄ'!$E101,COLUMN()-11,1)","v":""},{"$f":"MID('1入力ｼｰﾄ'!$E101,COLUMN()-11,1)","v":""},{"$f":"MID('1入力ｼｰﾄ'!$E101,COLUMN()-11,1)","v":""},{"$f":"MID('1入力ｼｰﾄ'!$E101,COLUMN()-11,1)","v":""},{"$f":"MID('1入力ｼｰﾄ'!$E101,COLUMN()-11,1)","v":""},{"$f":"MID('1入力ｼｰﾄ'!$E101,COLUMN()-11,1)","v":""},{"$f":"MID('1入力ｼｰﾄ'!$E101,COLUMN()-11,1)","v":""},{"$f":"MID('1入力ｼｰﾄ'!$E101,COLUMN()-11,1)","v":""},{"$f":"MID('1入力ｼｰﾄ'!$E101,COLUMN()-11,1)","v":""},{"$f":"MID('1入力ｼｰﾄ'!$E101,COLUMN()-11,1)","v":""},{"$f":"MID('1入力ｼｰﾄ'!$E101,COLUMN()-11,1)","v":""},{"$f":"MID('1入力ｼｰﾄ'!$E101,COLUMN()-11,1)","v":""},{"$f":"MID('1入力ｼｰﾄ'!$E101,COLUMN()-11,1)","v":""},{"$f":"MID('1入力ｼｰﾄ'!$E101,COLUMN()-11,1)","v":""},{"$f":"MID('1入力ｼｰﾄ'!$E101,COLUMN()-11,1)","v":""},{"$f":"MID('1入力ｼｰﾄ'!$E101,COLUMN()-11,1)","v":""},{"$f":"MID('1入力ｼｰﾄ'!$E101,COLUMN()-11,1)","v":""},{"$f":"MID('1入力ｼｰﾄ'!$E101,COLUMN()-11,1)","v":""},{"$f":"MID('1入力ｼｰﾄ'!$E101,COLUMN()-11,1)","v":""},{"$f":"MID('1入力ｼｰﾄ'!$E101,COLUMN()-11,1)","v":""},{"$f":"MID('1入力ｼｰﾄ'!$E101,COLUMN()-11,1)","v":""},{"$f":"MID('1入力ｼｰﾄ'!$E101,COLUMN()-11,1)","v":""},{"$f":"MID('1入力ｼｰﾄ'!$E101,COLUMN()-11,1)","v":""},{"$f":"MID('1入力ｼｰﾄ'!$E101,COLUMN()-11,1)","v":""},{"$f":"MID('1入力ｼｰﾄ'!$E101,COLUMN()-11,1)","v":""},{"$f":"MID('1入力ｼｰﾄ'!$E101,COLUMN()-11,1)","v":""},{"$f":"MID('1入力ｼｰﾄ'!$E101,COLUMN()-11,1)","v":""},{"$f":"MID('1入力ｼｰﾄ'!$E101,COLUMN()-11,1)","v":""},{"$f":"MID('1入力ｼｰﾄ'!$E101,COLUMN()-11,1)","v":""}]
[null,null,null,null,null,null,null,null,null,"漢字\n名称",null,null,null,null,null,null,null,null,null,null,null,null,null,null,null,null,null,null,null,null,null,null,null,null,null,null,null,null,null,null,null,null,null,null,null,null,null,null,null,null,null,"法人\n個人\n区分"]
[]
[null,null,null,null,null,null,null,"03",null,null,null,{"$f":"MID('1入力ｼｰﾄ'!$E96,COLUMN()-11,1)","v":""},{"$f":"MID('1入力ｼｰﾄ'!$E96,COLUMN()-11,1)","v":""},{"$f":"MID('1入力ｼｰﾄ'!$E96,COLUMN()-11,1)","v":""},{"$f":"MID('1入力ｼｰﾄ'!$E96,COLUMN()-11,1)","v":""},{"$f":"MID('1入力ｼｰﾄ'!$E96,COLUMN()-11,1)","v":""},{"$f":"MID('1入力ｼｰﾄ'!$E96,COLUMN()-11,1)","v":""},{"$f":"MID('1入力ｼｰﾄ'!$E96,COLUMN()-11,1)","v":""},{"$f":"MID('1入力ｼｰﾄ'!$E96,COLUMN()-11,1)","v":""},{"$f":"MID('1入力ｼｰﾄ'!$E96,COLUMN()-11,1)","v":""},{"$f":"MID('1入力ｼｰﾄ'!$E96,COLUMN()-11,1)","v":""},{"$f":"MID('1入力ｼｰﾄ'!$E96,COLUMN()-11,1)","v":""},{"$f":"MID('1入力ｼｰﾄ'!$E96,COLUMN()-11,1)","v":""},{"$f":"MID('1入力ｼｰﾄ'!$E96,COLUMN()-11,1)","v":""},{"$f":"MID('1入力ｼｰﾄ'!$E96,COLUMN()-11,1)","v":""},{"$f":"MID('1入力ｼｰﾄ'!$E96,COLUMN()-11,1)","v":""},{"$f":"MID('1入力ｼｰﾄ'!$E96,COLUMN()-11,1)","v":""},{"$f":"MID('1入力ｼｰﾄ'!$E96,COLUMN()-11,1)","v":""},{"$f":"MID('1入力ｼｰﾄ'!$E96,COLUMN()-11,1)","v":""},{"$f":"MID('1入力ｼｰﾄ'!$E96,COLUMN()-11,1)","v":""},{"$f":"MID('1入力ｼｰﾄ'!$E96,COLUMN()-11,1)","v":""},{"$f":"MID('1入力ｼｰﾄ'!$E96,COLUMN()-11,1)","v":""},{"$f":"MID('1入力ｼｰﾄ'!$E96,COLUMN()-11,1)","v":""},{"$f":"MID('1入力ｼｰﾄ'!$E96,COLUMN()-11,1)","v":""},{"$f":"MID('1入力ｼｰﾄ'!$E96,COLUMN()-11,1)","v":""},{"$f":"MID('1入力ｼｰﾄ'!$E96,COLUMN()-11,1)","v":""},{"$f":"MID('1入力ｼｰﾄ'!$E96,COLUMN()-11,1)","v":""},{"$f":"MID('1入力ｼｰﾄ'!$E96,COLUMN()-11,1)","v":""},{"$f":"MID('1入力ｼｰﾄ'!$E96,COLUMN()-11,1)","v":""},{"$f":"MID('1入力ｼｰﾄ'!$E96,COLUMN()-11,1)","v":""},{"$f":"MID('1入力ｼｰﾄ'!$E96,COLUMN()-11,1)","v":""},{"$f":"MID('1入力ｼｰﾄ'!$E96,COLUMN()-11,1)","v":""},{"$f":"MID('1入力ｼｰﾄ'!$E96,COLUMN()-11,1)","v":""},{"$f":"MID('1入力ｼｰﾄ'!$E96,COLUMN()-11,1)","v":""},{"$f":"MID('1入力ｼｰﾄ'!$E96,COLUMN()-11,1)","v":""},{"$f":"MID('1入力ｼｰﾄ'!$E96,COLUMN()-11,1)","v":""},{"$f":"MID('1入力ｼｰﾄ'!$E96,COLUMN()-11,1)","v":""},{"$f":"MID('1入力ｼｰﾄ'!$E96,COLUMN()-11,1)","v":""},{"$f":"MID('1入力ｼｰﾄ'!$E96,COLUMN()-11,1)","v":""},{"$f":"MID('1入力ｼｰﾄ'!$E96,COLUMN()-11,1)","v":""},{"$f":"MID('1入力ｼｰﾄ'!$E96,COLUMN()-11,1)","v":""},null,null,{"$f":"IF('1入力ｼｰﾄ'!E83=\"法人\",\"１\",(IF('1入力ｼｰﾄ'!E83=\"個人\",\"2\",\" \")))","v":" "}]
[null,null,null,null,null,null,null,null,null,null,null,"電　話\n番　号",null,null,null,null,null,null,null,null,null,null,null,null,null,null,null,null,"ＦＡＸ\n番 号"]
[]
[null,null,null,null,null,null,null,null,null,null,null,null,null,{"$f":"MID('1入力ｼｰﾄ'!$E188,COLUMN()-13,1)","v":""},{"$f":"MID('1入力ｼｰﾄ'!$E188,COLUMN()-13,1)","v":""},{"$f":"MID('1入力ｼｰﾄ'!$E188,COLUMN()-13,1)","v":""},{"$f":"MID('1入力ｼｰﾄ'!$E188,COLUMN()-13,1)","v":""},{"$f":"MID('1入力ｼｰﾄ'!$E188,COLUMN()-13,1)","v":""},{"$f":"MID('1入力ｼｰﾄ'!$E188,COLUMN()-13,1)","v":""},{"$f":"MID('1入力ｼｰﾄ'!$E188,COLUMN()-13,1)","v":""},{"$f":"MID('1入力ｼｰﾄ'!$E188,COLUMN()-13,1)","v":""},{"$f":"MID('1入力ｼｰﾄ'!$E188,COLUMN()-13,1)","v":""},{"$f":"MID('1入力ｼｰﾄ'!$E188,COLUMN()-13,1)","v":""},{"$f":"MID('1入力ｼｰﾄ'!$E188,COLUMN()-13,1)","v":""},{"$f":"MID('1入力ｼｰﾄ'!$E188,COLUMN()-13,1)","v":""},{"$f":"MID('1入力ｼｰﾄ'!$E188,COLUMN()-13,1)","v":""},{"$f":"MID('1入力ｼｰﾄ'!$E188,COLUMN()-13,1)","v":""},{"$f":"MID('1入力ｼｰﾄ'!$E188,COLUMN()-13,1)","v":""},null,null,{"$f":"MID('1入力ｼｰﾄ'!$E189,COLUMN()-30,1)","v":""},{"$f":"MID('1入力ｼｰﾄ'!$E189,COLUMN()-30,1)","v":""},{"$f":"MID('1入力ｼｰﾄ'!$E189,COLUMN()-30,1)","v":""},{"$f":"MID('1入力ｼｰﾄ'!$E189,COLUMN()-30,1)","v":""},{"$f":"MID('1入力ｼｰﾄ'!$E189,COLUMN()-30,1)","v":""},{"$f":"MID('1入力ｼｰﾄ'!$E189,COLUMN()-30,1)","v":""},{"$f":"MID('1入力ｼｰﾄ'!$E189,COLUMN()-30,1)","v":""},{"$f":"MID('1入力ｼｰﾄ'!$E189,COLUMN()-30,1)","v":""},{"$f":"MID('1入力ｼｰﾄ'!$E189,COLUMN()-30,1)","v":""},{"$f":"MID('1入力ｼｰﾄ'!$E189,COLUMN()-30,1)","v":""},{"$f":"MID('1入力ｼｰﾄ'!$E189,COLUMN()-30,1)","v":""},{"$f":"MID('1入力ｼｰﾄ'!$E189,COLUMN()-30,1)","v":""},{"$f":"MID('1入力ｼｰﾄ'!$E189,COLUMN()-30,1)","v":""},{"$f":"MID('1入力ｼｰﾄ'!$E189,COLUMN()-30,1)","v":""},{"$f":"MID('1入力ｼｰﾄ'!$E189,COLUMN()-30,1)","v":""},null,null,null,{"$f":"出力ｼｰﾄ1!AJ36","v":0},null,null,null,{"$f":"出力ｼｰﾄ1!AJ37","v":0}]
[null,null,"所在地\n・\n代表者",null,null,null,null,null,null,"郵便\n番号",null,null,null,null,null,null,null,null,null,"都道府県\nコード",null,null,null,null,"都道府県\n（名称）"]
[null,null,null,null,null,null,null,null,null,null,null,null,null,null,"―"]
[null,null,null,null,null,null,null,"04",null,null,null,{"$f":"MID('1入力ｼｰﾄ'!$E130,COLUMN()-11,1)","v":""},{"$f":"MID('1入力ｼｰﾄ'!$E130,COLUMN()-11,1)","v":""},{"$f":"MID('1入力ｼｰﾄ'!$E130,COLUMN()-11,1)","v":""},null,{"$f":"MID('1入力ｼｰﾄ'!$I130,COLUMN()-15,1)","v":""},{"$f":"MID('1入力ｼｰﾄ'!$I130,COLUMN()-15,1)","v":""},{"$f":"MID('1入力ｼｰﾄ'!$I130,COLUMN()-15,1)","v":""},{"$f":"MID('1入力ｼｰﾄ'!$I130,COLUMN()-15,1)","v":""},null,null,null,{"$f":"MID('1入力ｼｰﾄ'!$E134,COLUMN()-22,1)","v":""},{"$f":"MID('1入力ｼｰﾄ'!$E134,COLUMN()-22,1)","v":""},null,null,null,{"$f":"MID('1入力ｼｰﾄ'!$E134,COLUMN()-24,1)","v":""},{"$f":"MID('1入力ｼｰﾄ'!$E134,COLUMN()-24,1)","v":""},{"$f":"MID('1入力ｼｰﾄ'!$E134,COLUMN()-24,1)","v":""},{"$f":"MID('1入力ｼｰﾄ'!$E134,COLUMN()-24,1)","v":""}]
[null,null,null,null,null,null,null,null,null,"市区町\n村以降"]
[]
[null,null,null,null,null,null,null,"05",null,null,null,{"$f":"MID('1入力ｼｰﾄ'!$E141,COLUMN()-11,1)","v":""},{"$f":"MID('1入力ｼｰﾄ'!$E141,COLUMN()-11,1)","v":""},{"$f":"MID('1入力ｼｰﾄ'!$E141,COLUMN()-11,1)","v":""},{"$f":"MID('1入力ｼｰﾄ'!$E141,COLUMN()-11,1)","v":""},{"$f":"MID('1入力ｼｰﾄ'!$E141,COLUMN()-11,1)","v":""},{"$f":"MID('1入力ｼｰﾄ'!$E141,COLUMN()-11,1)","v":""},{"$f":"MID('1入力ｼｰﾄ'!$E141,COLUMN()-11,1)","v":""},{"$f":"MID('1入力ｼｰﾄ'!$E141,COLUMN()-11,1)","v":""},{"$f":"MID('1入力ｼｰﾄ'!$E141,COLUMN()-11,1)","v":""},{"$f":"MID('1入力ｼｰﾄ'!$E141,COLUMN()-11,1)","v":""},{"$f":"MID('1入力ｼｰﾄ'!$E141,COLUMN()-11,1)","v":""},{"$f":"MID('1入力ｼｰﾄ'!$E141,COLUMN()-11,1)","v":""},{"$f":"MID('1入力ｼｰﾄ'!$E141,COLUMN()-11,1)","v":""},{"$f":"MID('1入力ｼｰﾄ'!$E141,COLUMN()-11,1)","v":""},{"$f":"MID('1入力ｼｰﾄ'!$E141,COLUMN()-11,1)","v":""},{"$f":"MID('1入力ｼｰﾄ'!$E141,COLUMN()-11,1)","v":""},{"$f":"MID('1入力ｼｰﾄ'!$E141,COLUMN()-11,1)","v":""},{"$f":"MID('1入力ｼｰﾄ'!$E141,COLUMN()-11,1)","v":""},{"$f":"MID('1入力ｼｰﾄ'!$E141,COLUMN()-11,1)","v":""},{"$f":"MID('1入力ｼｰﾄ'!$E141,COLUMN()-11,1)","v":""},{"$f":"MID('1入力ｼｰﾄ'!$E141,COLUMN()-11,1)","v":""},{"$f":"MID('1入力ｼｰﾄ'!$E141,COLUMN()-11,1)","v":""},{"$f":"MID('1入力ｼｰﾄ'!$E141,COLUMN()-11,1)","v":""},{"$f":"MID('1入力ｼｰﾄ'!$E141,COLUMN()-11,1)","v":""},{"$f":"MID('1入力ｼｰﾄ'!$E141,COLUMN()-11,1)","v":""},{"$f":"MID('1入力ｼｰﾄ'!$E141,COLUMN()-11,1)","v":""},{"$f":"MID('1入力ｼｰﾄ'!$E141,COLUMN()-11,1)","v":""},{"$f":"MID('1入力ｼｰﾄ'!$E141,COLUMN()-11,1)","v":""},{"$f":"MID('1入力ｼｰﾄ'!$E141,COLUMN()-11,1)","v":""},{"$f":"MID('1入力ｼｰﾄ'!$E141,COLUMN()-11,1)","v":""},{"$f":"MID('1入力ｼｰﾄ'!$E141,COLUMN()-11,1)","v":""},{"$f":"MID('1入力ｼｰﾄ'!$E141,COLUMN()-11,1)","v":""},{"$f":"MID('1入力ｼｰﾄ'!$E141,COLUMN()-11,1)","v":""},{"$f":"MID('1入力ｼｰﾄ'!$E141,COLUMN()-11,1)","v":""},{"$f":"MID('1入力ｼｰﾄ'!$E141,COLUMN()-11,1)","v":""},{"$f":"MID('1入力ｼｰﾄ'!$E141,COLUMN()-11,1)","v":""},{"$f":"MID('1入力ｼｰﾄ'!$E141,COLUMN()-11,1)","v":""},{"$f":"MID('1入力ｼｰﾄ'!$E141,COLUMN()-11,1)","v":""},{"$f":"MID('1入力ｼｰﾄ'!$E141,COLUMN()-11,1)","v":""},{"$f":"MID('1入力ｼｰﾄ'!$E141,COLUMN()-11,1)","v":""},{"$f":"MID('1入力ｼｰﾄ'!$E141,COLUMN()-11,1)","v":""},{"$f":"MID('1入力ｼｰﾄ'!$E141,COLUMN()-11,1)","v":""},{"$f":"MID('1入力ｼｰﾄ'!$E141,COLUMN()-11,1)","v":""},{"$f":"MID('1入力ｼｰﾄ'!$E141,COLUMN()-11,1)","v":""},{"$f":"MID('1入力ｼｰﾄ'!$E141,COLUMN()-11,1)","v":""},{"$f":"MID('1入力ｼｰﾄ'!$E141,COLUMN()-11,1)","v":""},{"$f":"MID('1入力ｼｰﾄ'!$E141,COLUMN()-11,1)","v":""},{"$f":"MID('1入力ｼｰﾄ'!$E141,COLUMN()-11,1)","v":""},{"$f":"MID('1入力ｼｰﾄ'!$E141,COLUMN()-11,1)","v":""},{"$f":"MID('1入力ｼｰﾄ'!$E141,COLUMN()-11,1)","v":""},{"$f":"MID('1入力ｼｰﾄ'!$E141,COLUMN()-11,1)","v":""},{"$f":"MID('1入力ｼｰﾄ'!$E141,COLUMN()-11,1)","v":""},{"$f":"MID('1入力ｼｰﾄ'!$E141,COLUMN()-11,1)","v":""},{"$f":"MID('1入力ｼｰﾄ'!$E141,COLUMN()-11,1)","v":""},{"$f":"MID('1入力ｼｰﾄ'!$E141,COLUMN()-11,1)","v":""}]
[null,null,null,null,null,null,null,null,null,"代表者役職\n(漢字）",null,null,null,null,null,null,null,null,null,null,null,null,null,null,null,null,null,null,null,null,null,null,null,null,null,null,null,null,null,null,null,"代表者\n氏名\n(漢字）"]
[]
[null,null,null,null,null,null,null,null,null,null,null,{"$f":"MID('1入力ｼｰﾄ'!$E106,COLUMN()-11,1)","v":""},{"$f":"MID('1入力ｼｰﾄ'!$E106,COLUMN()-11,1)","v":""},{"$f":"MID('1入力ｼｰﾄ'!$E106,COLUMN()-11,1)","v":""},{"$f":"MID('1入力ｼｰﾄ'!$E106,COLUMN()-11,1)","v":""},{"$f":"MID('1入力ｼｰﾄ'!$E106,COLUMN()-11,1)","v":""},{"$f":"MID('1入力ｼｰﾄ'!$E106,COLUMN()-11,1)","v":""},{"$f":"MID('1入力ｼｰﾄ'!$E106,COLUMN()-11,1)","v":""},{"$f":"MID('1入力ｼｰﾄ'!$E106,COLUMN()-11,1)","v":""},{"$f":"MID('1入力ｼｰﾄ'!$E106,COLUMN()-11,1)","v":""},{"$f":"MID('1入力ｼｰﾄ'!$E106,COLUMN()-11,1)","v":""},{"$f":"MID('1入力ｼｰﾄ'!$E106,COLUMN()-11,1)","v":""},{"$f":"MID('1入力ｼｰﾄ'!$E106,COLUMN()-11,1)","v":""},{"$f":"MID('1入力ｼｰﾄ'!$E106,COLUMN()-11,1)","v":""},{"$f":"MID('1入力ｼｰﾄ'!$E106,COLUMN()-11,1)","v":""},{"$f":"MID('1入力ｼｰﾄ'!$E106,COLUMN()-11,1)","v":""},{"$f":"MID('1入力ｼｰﾄ'!$E106,COLUMN()-11,1)","v":""},{"$f":"MID('1入力ｼｰﾄ'!$E106,COLUMN()-11,1)","v":""},{"$f":"MID('1入力ｼｰﾄ'!$E106,COLUMN()-11,1)","v":""},{"$f":"MID('1入力ｼｰﾄ'!$E106,COLUMN()-11,1)","v":""},{"$f":"MID('1入力ｼｰﾄ'!$E106,COLUMN()-11,1)","v":""},{"$f":"MID('1入力ｼｰﾄ'!$E106,COLUMN()-11,1)","v":""},{"$f":"MID('1入力ｼｰﾄ'!$E106,COLUMN()-11,1)","v":""},{"$f":"MID('1入力ｼｰﾄ'!$E106,COLUMN()-11,1)","v":""},{"$f":"MID('1入力ｼｰﾄ'!$E106,COLUMN()-11,1)","v":""},{"$f":"MID('1入力ｼｰﾄ'!$E106,COLUMN()-11,1)","v":""},{"$f":"MID('1入力ｼｰﾄ'!$E106,COLUMN()-11,1)","v":""},{"$f":"MID('1入力ｼｰﾄ'!$E106,COLUMN()-11,1)","v":""},{"$f":"MID('1入力ｼｰﾄ'!$E106,COLUMN()-11,1)","v":""},{"$f":"MID('1入力ｼｰﾄ'!$E106,COLUMN()-11,1)","v":""},{"$f":"MID('1入力ｼｰﾄ'!$E106,COLUMN()-11,1)","v":""},null,null,{"$f":"MID('1入力ｼｰﾄ'!$E111,COLUMN()-43,1)","v":""},{"$f":"MID('1入力ｼｰﾄ'!$E111,COLUMN()-43,1)","v":""},{"$f":"MID('1入力ｼｰﾄ'!$E111,COLUMN()-43,1)","v":""},{"$f":"MID('1入力ｼｰﾄ'!$E111,COLUMN()-43,1)","v":""},{"$f":"MID('1入力ｼｰﾄ'!$E111,COLUMN()-43,1)","v":""},{"$f":"MID('1入力ｼｰﾄ'!$E111,COLUMN()-43,1)","v":""},{"$f":"MID('1入力ｼｰﾄ'!$E111,COLUMN()-43,1)","v":""},{"$f":"MID('1入力ｼｰﾄ'!$E111,COLUMN()-43,1)","v":""},{"$f":"MID('1入力ｼｰﾄ'!$E111,COLUMN()-43,1)","v":""},{"$f":"MID('1入力ｼｰﾄ'!$E111,COLUMN()-43,1)","v":""},{"$f":"MID('1入力ｼｰﾄ'!$E111,COLUMN()-43,1)","v":""},{"$f":"MID('1入力ｼｰﾄ'!$E111,COLUMN()-43,1)","v":""},{"$f":"MID('1入力ｼｰﾄ'!$E111,COLUMN()-43,1)","v":""},{"$f":"MID('1入力ｼｰﾄ'!$E111,COLUMN()-43,1)","v":""},{"$f":"MID('1入力ｼｰﾄ'!$E111,COLUMN()-43,1)","v":""},{"$f":"MID('1入力ｼｰﾄ'!$E111,COLUMN()-43,1)","v":""},{"$f":"MID('1入力ｼｰﾄ'!$E111,COLUMN()-43,1)","v":""},{"$f":"MID('1入力ｼｰﾄ'!$E111,COLUMN()-43,1)","v":""},{"$f":"MID('1入力ｼｰﾄ'!$E111,COLUMN()-43,1)","v":""},{"$f":"MID('1入力ｼｰﾄ'!$E111,COLUMN()-43,1)","v":""}]
[null,null,"その他",null,null,null,null,null,null,"資本金\n(単位：千円)",null,null,null,null,null,null,null,null,null,null,null,null,null,"外国資本\nの割合\n(単位：%)",null,null,null,null,"従業\n員数"]
[null,null,null,null,null,null,null,null,null,null,null,null,null,"一兆",null,null,"十億",null,null,"百万",null,null,"千円",null,null,"百","十","%",null,null,"十万","万","千","百","十","人",null,null,"千","百","十","人",null,null,"千","百","十","人"]
[null,null,null,null,null,null,null,"06",null,null,null,{"$f":"MID(TEXT('1入力ｼｰﾄ'!$E172,\"???????????0\"),COLUMN()-11,1)","v":" "},{"$f":"MID(TEXT('1入力ｼｰﾄ'!$E172,\"???????????0\"),COLUMN()-11,1)","v":" "},{"$f":"MID(TEXT('1入力ｼｰﾄ'!$E172,\"???????????0\"),COLUMN()-11,1)","v":" "},{"$f":"MID(TEXT('1入力ｼｰﾄ'!$E172,\"???????????0\"),COLUMN()-11,1)","v":" "},{"$f":"MID(TEXT('1入力ｼｰﾄ'!$E172,\"???????????0\"),COLUMN()-11,1)","v":" "},{"$f":"MID(TEXT('1入力ｼｰﾄ'!$E172,\"???????????0\"),COLUMN()-11,1)","v":" "},{"$f":"MID(TEXT('1入力ｼｰﾄ'!$E172,\"???????????0\"),COLUMN()-11,1)","v":" "},{"$f":"MID(TEXT('1入力ｼｰﾄ'!$E172,\"???????????0\"),COLUMN()-11,1)","v":" "},{"$f":"MID(TEXT('1入力ｼｰﾄ'!$E172,\"???????????0\"),COLUMN()-11,1)","v":" "},{"$f":"MID(TEXT('1入力ｼｰﾄ'!$E172,\"???????????0\"),COLUMN()-11,1)","v":" "},{"$f":"MID(TEXT('1入力ｼｰﾄ'!$E172,\"???????????0\"),COLUMN()-11,1)","v":" "},{"$f":"MID(TEXT('1入力ｼｰﾄ'!$E172,\"???????????0\"),COLUMN()-11,1)","v":"0"},null,null,{"$f":"MID(TEXT('1入力ｼｰﾄ'!$E177,\"??0\"),COLUMN()-25,1)","v":" "},{"$f":"MID(TEXT('1入力ｼｰﾄ'!$E177,\"??0\"),COLUMN()-25,1)","v":" "},{"$f":"MID(TEXT('1入力ｼｰﾄ'!$E177,\"??0\"),COLUMN()-25,1)","v":"0"},null,null,{"$f":"MID(TEXT('1入力ｼｰﾄ'!$E193,\"??????\"),COLUMN()-30,1)","v":" "},{"$f":"MID(TEXT('1入力ｼｰﾄ'!$E193,\"??????\"),COLUMN()-30,1)","v":" "},{"$f":"MID(TEXT('1入力ｼｰﾄ'!$E193,\"??????\"),COLUMN()-30,1)","v":" "},{"$f":"MID(TEXT('1入力ｼｰﾄ'!$E193,\"??????\"),COLUMN()-30,1)","v":" "},{"$f":"MID(TEXT('1入力ｼｰﾄ'!$E193,\"??????\"),COLUMN()-30,1)","v":" "},{"$f":"MID(TEXT('1入力ｼｰﾄ'!$E193,\"??????\"),COLUMN()-30,1)","v":" "},null,null,{"$f":"MID(TEXT(出力ｼｰﾄ1!$AJ34,\"???0\"),COLUMN()-38,1)","v":" "},{"$f":"MID(TEXT(出力ｼｰﾄ1!$AJ34,\"???0\"),COLUMN()-38,1)","v":" "},{"$f":"MID(TEXT(出力ｼｰﾄ1!$AJ34,\"???0\"),COLUMN()-38,1)","v":" "},{"$f":"MID(TEXT(出力ｼｰﾄ1!$AJ34,\"???0\"),COLUMN()-38,1)","v":"0"},null,null,{"$f":"MID(TEXT(出力ｼｰﾄ1!$AJ35,\"???0\"),COLUMN()-44,1)","v":" "},{"$f":"MID(TEXT(出力ｼｰﾄ1!$AJ35,\"???0\"),COLUMN()-44,1)","v":" "},{"$f":"MID(TEXT(出力ｼｰﾄ1!$AJ35,\"???0\"),COLUMN()-44,1)","v":" "},{"$f":"MID(TEXT(出力ｼｰﾄ1!$AJ35,\"???0\"),COLUMN()-44,1)","v":"0"}]
[null,null,null,null,null,null,null,null,null,"前年度\n売上高\n(単位：千円)",null,null,null,null,null,null,null,null,null,null,null,null,null,"前々年度\n売上高\n(単位：千円)",null,null,null,null,null,null,null,null,null,null,null,null,null,"創業\n年月日\n(西暦)"]
[null,null,null,null,null,null,null,null,null,null,null,null,null,"一兆",null,null,"十億",null,null,"百万",null,null,"千円",null,null,null,null,"一兆",null,null,"十億",null,null,"百万",null,null,"千円",null,null,"西暦",null,null,"年",null,"月",null,"日"]
[null,null,null,null,null,null,null,"07",null,null,null,{"$f":"MID(TEXT('1入力ｼｰﾄ'!$E182,\"???????????0\"),COLUMN()-11,1)","v":" "},{"$f":"MID(TEXT('1入力ｼｰﾄ'!$E182,\"???????????0\"),COLUMN()-11,1)","v":" "},{"$f":"MID(TEXT('1入力ｼｰﾄ'!$E182,\"???????????0\"),COLUMN()-11,1)","v":" "},{"$f":"MID(TEXT('1入力ｼｰﾄ'!$E182,\"???????????0\"),COLUMN()-11,1)","v":" "},{"$f":"MID(TEXT('1入力ｼｰﾄ'!$E182,\"???????????0\"),COLUMN()-11,1)","v":" "},{"$f":"MID(TEXT('1入力ｼｰﾄ'!$E182,\"???????????0\"),COLUMN()-11,1)","v":" "},{"$f":"MID(TEXT('1入力ｼｰﾄ'!$E182,\"???????????0\"),COLUMN()-11,1)","v":" "},{"$f":"MID(TEXT('1入力ｼｰﾄ'!$E182,\"???????????0\"),COLUMN()-11,1)","v":" "},{"$f":"MID(TEXT('1入力ｼｰﾄ'!$E182,\"???????????0\"),COLUMN()-11,1)","v":" "},{"$f":"MID(TEXT('1入力ｼｰﾄ'!$E182,\"???????????0\"),COLUMN()-11,1)","v":" "},{"$f":"MID(TEXT('1入力ｼｰﾄ'!$E182,\"???????????0\"),COLUMN()-11,1)","v":" "},{"$f":"MID(TEXT('1入力ｼｰﾄ'!$E182,\"???????????0\"),COLUMN()-11,1)","v":"0"},null,null,{"$f":"MID(TEXT('1入力ｼｰﾄ'!$E183,\"???????????0\"),COLUMN()-25,1)","v":" "},{"$f":"MID(TEXT('1入力ｼｰﾄ'!$E183,\"???????????0\"),COLUMN()-25,1)","v":" "},{"$f":"MID(TEXT('1入力ｼｰﾄ'!$E183,\"???????????0\"),COLUMN()-25,1)","v":" "},{"$f":"MID(TEXT('1入力ｼｰﾄ'!$E183,\"???????????0\"),COLUMN()-25,1)","v":" "},{"$f":"MID(TEXT('1入力ｼｰﾄ'!$E183,\"???????????0\"),COLUMN()-25,1)","v":" "},{"$f":"MID(TEXT('1入力ｼｰﾄ'!$E183,\"???????????0\"),COLUMN()-25,1)","v":" "},{"$f":"MID(TEXT('1入力ｼｰﾄ'!$E183,\"???????????0\"),COLUMN()-25,1)","v":" "},{"$f":"MID(TEXT('1入力ｼｰﾄ'!$E183,\"???????????0\"),COLUMN()-25,1)","v":" "},{"$f":"MID(TEXT('1入力ｼｰﾄ'!$E183,\"???????????0\"),COLUMN()-25,1)","v":" "},{"$f":"MID(TEXT('1入力ｼｰﾄ'!$E183,\"???????????0\"),COLUMN()-25,1)","v":" "},{"$f":"MID(TEXT('1入力ｼｰﾄ'!$E183,\"???????????0\"),COLUMN()-25,1)","v":" "},{"$f":"MID(TEXT('1入力ｼｰﾄ'!$E183,\"???????????0\"),COLUMN()-25,1)","v":"0"},null,null,{"$f":"MID(TEXT('1入力ｼｰﾄ'!$E167,\"????\"),COLUMN()-39,1)","v":" "},{"$f":"MID(TEXT('1入力ｼｰﾄ'!$E167,\"????\"),COLUMN()-39,1)","v":" "},{"$f":"MID(TEXT('1入力ｼｰﾄ'!$E167,\"????\"),COLUMN()-39,1)","v":" "},{"$f":"MID(TEXT('1入力ｼｰﾄ'!$E167,\"????\"),COLUMN()-39,1)","v":" "},{"$f":"MID('1入力ｼｰﾄ'!$J167,COLUMN()-43,1)","v":""},{"$f":"MID('1入力ｼｰﾄ'!$J167,COLUMN()-43,1)","v":""},{"$f":"MID('1入力ｼｰﾄ'!$M167,COLUMN()-45,1)","v":""},{"$f":"MID('1入力ｼｰﾄ'!$M167,COLUMN()-45,1)","v":""},"",""]
[]
[]
[]
[]
[null,"受任者を置く場合のみ","（支店等）\n\n名称等",null,null,null,null,null,null,"名称\n(漢字)"]
[]
[null,null,null,null,null,null,null,"08",null,null,null,{"$f":"IF(出力ｼｰﾄ1!$AJ38=1,\"#\",MID('1入力ｼｰﾄ'!$E222,COLUMN()-11,1))","v":""},{"$f":"IF(出力ｼｰﾄ1!$AJ38=1,\"\",MID('1入力ｼｰﾄ'!$E222,COLUMN()-11,1))","v":""},{"$f":"IF(出力ｼｰﾄ1!$AJ38=1,\"\",MID('1入力ｼｰﾄ'!$E222,COLUMN()-11,1))","v":""},{"$f":"IF(出力ｼｰﾄ1!$AJ38=1,\"\",MID('1入力ｼｰﾄ'!$E222,COLUMN()-11,1))","v":""},{"$f":"IF(出力ｼｰﾄ1!$AJ38=1,\"\",MID('1入力ｼｰﾄ'!$E222,COLUMN()-11,1))","v":""},{"$f":"IF(出力ｼｰﾄ1!$AJ38=1,\"\",MID('1入力ｼｰﾄ'!$E222,COLUMN()-11,1))","v":""},{"$f":"IF(出力ｼｰﾄ1!$AJ38=1,\"\",MID('1入力ｼｰﾄ'!$E222,COLUMN()-11,1))","v":""},{"$f":"IF(出力ｼｰﾄ1!$AJ38=1,\"\",MID('1入力ｼｰﾄ'!$E222,COLUMN()-11,1))","v":""},{"$f":"IF(出力ｼｰﾄ1!$AJ38=1,\"\",MID('1入力ｼｰﾄ'!$E222,COLUMN()-11,1))","v":""},{"$f":"IF(出力ｼｰﾄ1!$AJ38=1,\"\",MID('1入力ｼｰﾄ'!$E222,COLUMN()-11,1))","v":""},{"$f":"IF(出力ｼｰﾄ1!$AJ38=1,\"\",MID('1入力ｼｰﾄ'!$E222,COLUMN()-11,1))","v":""},{"$f":"IF(出力ｼｰﾄ1!$AJ38=1,\"\",MID('1入力ｼｰﾄ'!$E222,COLUMN()-11,1))","v":""},{"$f":"IF(出力ｼｰﾄ1!$AJ38=1,\"\",MID('1入力ｼｰﾄ'!$E222,COLUMN()-11,1))","v":""},{"$f":"IF(出力ｼｰﾄ1!$AJ38=1,\"\",MID('1入力ｼｰﾄ'!$E222,COLUMN()-11,1))","v":""},{"$f":"IF(出力ｼｰﾄ1!$AJ38=1,\"\",MID('1入力ｼｰﾄ'!$E222,COLUMN()-11,1))","v":""},{"$f":"IF(出力ｼｰﾄ1!$AJ38=1,\"\",MID('1入力ｼｰﾄ'!$E222,COLUMN()-11,1))","v":""},{"$f":"IF(出力ｼｰﾄ1!$AJ38=1,\"\",MID('1入力ｼｰﾄ'!$E222,COLUMN()-11,1))","v":""},{"$f":"IF(出力ｼｰﾄ1!$AJ38=1,\"\",MID('1入力ｼｰﾄ'!$E222,COLUMN()-11,1))","v":""},{"$f":"IF(出力ｼｰﾄ1!$AJ38=1,\"\",MID('1入力ｼｰﾄ'!$E222,COLUMN()-11,1))","v":""},{"$f":"IF(出力ｼｰﾄ1!$AJ38=1,\"\",MID('1入力ｼｰﾄ'!$E222,COLUMN()-11,1))","v":""},{"$f":"IF(出力ｼｰﾄ1!$AJ38=1,\"\",MID('1入力ｼｰﾄ'!$E222,COLUMN()-11,1))","v":""},{"$f":"IF(出力ｼｰﾄ1!$AJ38=1,\"\",MID('1入力ｼｰﾄ'!$E222,COLUMN()-11,1))","v":""},{"$f":"IF(出力ｼｰﾄ1!$AJ38=1,\"\",MID('1入力ｼｰﾄ'!$E222,COLUMN()-11,1))","v":""},{"$f":"IF(出力ｼｰﾄ1!$AJ38=1,\"\",MID('1入力ｼｰﾄ'!$E222,COLUMN()-11,1))","v":""},{"$f":"IF(出力ｼｰﾄ1!$AJ38=1,\"\",MID('1入力ｼｰﾄ'!$E222,COLUMN()-11,1))","v":""},{"$f":"IF(出力ｼｰﾄ1!$AJ38=1,\"\",MID('1入力ｼｰﾄ'!$E222,COLUMN()-11,1))","v":""},{"$f":"IF(出力ｼｰﾄ1!$AJ38=1,\"\",MID('1入力ｼｰﾄ'!$E222,COLUMN()-11,1))","v":""},{"$f":"IF(出力ｼｰﾄ1!$AJ38=1,\"\",MID('1入力ｼｰﾄ'!$E222,COLUMN()-11,1))","v":""},{"$f":"IF(出力ｼｰﾄ1!$AJ38=1,\"\",MID('1入力ｼｰﾄ'!$E222,COLUMN()-11,1))","v":""},{"$f":"IF(出力ｼｰﾄ1!$AJ38=1,\"\",MID('1入力ｼｰﾄ'!$E222,COLUMN()-11,1))","v":""},{"$f":"IF(出力ｼｰﾄ1!$AJ38=1,\"\",MID('1入力ｼｰﾄ'!$E222,COLUMN()-11,1))","v":""},{"$f":"IF(出力ｼｰﾄ1!$AJ38=1,\"\",MID('1入力ｼｰﾄ'!$E222,COLUMN()-11,1))","v":""},{"$f":"IF(出力ｼｰﾄ1!$AJ38=1,\"\",MID('1入力ｼｰﾄ'!$E222,COLUMN()-11,1))","v":""},{"$f":"IF(出力ｼｰﾄ1!$AJ38=1,\"\",MID('1入力ｼｰﾄ'!$E222,COLUMN()-11,1))","v":""},{"$f":"IF(出力ｼｰﾄ1!$AJ38=1,\"\",MID('1入力ｼｰﾄ'!$E222,COLUMN()-11,1))","v":""},{"$f":"IF(出力ｼｰﾄ1!$AJ38=1,\"\",MID('1入力ｼｰﾄ'!$E222,COLUMN()-11,1))","v":""}]
[null,null,null,null,null,null,null,null,null,null,null,"電　話\n番　号",null,null,null,null,null,null,null,null,null,null,null,null,null,null,null,null,"ＦＡＸ\n番 号"]
[]
[null,null,null,null,null,null,null,null,null,null,null,null,null,{"$f":"IF(出力ｼｰﾄ1!$AJ38=1,\"#\",MID('1入力ｼｰﾄ'!$E243,COLUMN()-13,1))","v":""},{"$f":"IF(出力ｼｰﾄ1!$AJ38=1,\"\",MID('1入力ｼｰﾄ'!$E243,COLUMN()-13,1))","v":""},{"$f":"IF(出力ｼｰﾄ1!$AJ38=1,\"\",MID('1入力ｼｰﾄ'!$E243,COLUMN()-13,1))","v":""},{"$f":"IF(出力ｼｰﾄ1!$AJ38=1,\"\",MID('1入力ｼｰﾄ'!$E243,COLUMN()-13,1))","v":""},{"$f":"IF(出力ｼｰﾄ1!$AJ38=1,\"\",MID('1入力ｼｰﾄ'!$E243,COLUMN()-13,1))","v":""},{"$f":"IF(出力ｼｰﾄ1!$AJ38=1,\"\",MID('1入力ｼｰﾄ'!$E243,COLUMN()-13,1))","v":""},{"$f":"IF(出力ｼｰﾄ1!$AJ38=1,\"\",MID('1入力ｼｰﾄ'!$E243,COLUMN()-13,1))","v":""},{"$f":"IF(出力ｼｰﾄ1!$AJ38=1,\"\",MID('1入力ｼｰﾄ'!$E243,COLUMN()-13,1))","v":""},{"$f":"IF(出力ｼｰﾄ1!$AJ38=1,\"\",MID('1入力ｼｰﾄ'!$E243,COLUMN()-13,1))","v":""},{"$f":"IF(出力ｼｰﾄ1!$AJ38=1,\"\",MID('1入力ｼｰﾄ'!$E243,COLUMN()-13,1))","v":""},{"$f":"IF(出力ｼｰﾄ1!$AJ38=1,\"\",MID('1入力ｼｰﾄ'!$E243,COLUMN()-13,1))","v":""},{"$f":"IF(出力ｼｰﾄ1!$AJ38=1,\"\",MID('1入力ｼｰﾄ'!$E243,COLUMN()-13,1))","v":""},{"$f":"IF(出力ｼｰﾄ1!$AJ38=1,\"\",MID('1入力ｼｰﾄ'!$E243,COLUMN()-13,1))","v":""},{"$f":"IF(出力ｼｰﾄ1!$AJ38=1,\"\",MID('1入力ｼｰﾄ'!$E243,COLUMN()-13,1))","v":""},{"$f":"IF(出力ｼｰﾄ1!$AJ38=1,\"\",MID('1入力ｼｰﾄ'!$E243,COLUMN()-13,1))","v":""},null,null,{"$f":"IF(出力ｼｰﾄ1!$AJ38=1,\"#\",MID('1入力ｼｰﾄ'!$E244,COLUMN()-30,1))","v":""},{"$f":"IF(出力ｼｰﾄ1!$AJ38=1,\"\",MID('1入力ｼｰﾄ'!$E244,COLUMN()-30,1))","v":""},{"$f":"IF(出力ｼｰﾄ1!$AJ38=1,\"\",MID('1入力ｼｰﾄ'!$E244,COLUMN()-30,1))","v":""},{"$f":"IF(出力ｼｰﾄ1!$AJ38=1,\"\",MID('1入力ｼｰﾄ'!$E244,COLUMN()-30,1))","v":""},{"$f":"IF(出力ｼｰﾄ1!$AJ38=1,\"\",MID('1入力ｼｰﾄ'!$E244,COLUMN()-30,1))","v":""},{"$f":"IF(出力ｼｰﾄ1!$AJ38=1,\"\",MID('1入力ｼｰﾄ'!$E244,COLUMN()-30,1))","v":""},{"$f":"IF(出力ｼｰﾄ1!$AJ38=1,\"\",MID('1入力ｼｰﾄ'!$E244,COLUMN()-30,1))","v":""},{"$f":"IF(出力ｼｰﾄ1!$AJ38=1,\"\",MID('1入力ｼｰﾄ'!$E244,COLUMN()-30,1))","v":""},{"$f":"IF(出力ｼｰﾄ1!$AJ38=1,\"\",MID('1入力ｼｰﾄ'!$E244,COLUMN()-30,1))","v":""},{"$f":"IF(出力ｼｰﾄ1!$AJ38=1,\"\",MID('1入力ｼｰﾄ'!$E244,COLUMN()-30,1))","v":""},{"$f":"IF(出力ｼｰﾄ1!$AJ38=1,\"\",MID('1入力ｼｰﾄ'!$E244,COLUMN()-30,1))","v":""},{"$f":"IF(出力ｼｰﾄ1!$AJ38=1,\"\",MID('1入力ｼｰﾄ'!$E244,COLUMN()-30,1))","v":""},{"$f":"IF(出力ｼｰﾄ1!$AJ38=1,\"\",MID('1入力ｼｰﾄ'!$E244,COLUMN()-30,1))","v":""},{"$f":"IF(出力ｼｰﾄ1!$AJ38=1,\"\",MID('1入力ｼｰﾄ'!$E244,COLUMN()-30,1))","v":""},{"$f":"IF(出力ｼｰﾄ1!$AJ38=1,\"\",MID('1入力ｼｰﾄ'!$E244,COLUMN()-30,1))","v":""}]
[null,null,"所在地",null,null,null,null,null,null,"郵　便\n番　号",null,null,null,null,null,null,null,null,null,"都道府県\nコード",null,null,null,null,"都道府県\n（名称）"]
[null,null,null,null,null,null,null,null,null,null,null,null,null,null,"―"]
[null,null,null,null,null,null,null,"09",null,null,null,{"$f":"IF(出力ｼｰﾄ1!$AJ38=1,\"#\",MID('1入力ｼｰﾄ'!$E227,COLUMN()-11,1))","v":""},{"$f":"IF(出力ｼｰﾄ1!$AJ38=1,\"\",MID('1入力ｼｰﾄ'!$E227,COLUMN()-11,1))","v":""},{"$f":"IF(出力ｼｰﾄ1!$AJ38=1,\"\",MID('1入力ｼｰﾄ'!$E227,COLUMN()-11,1))","v":""},null,{"$f":"IF(出力ｼｰﾄ1!$AJ38=1,\"\",MID('1入力ｼｰﾄ'!$I227,COLUMN()-15,1))","v":""},{"$f":"IF(出力ｼｰﾄ1!$AJ38=1,\"\",MID('1入力ｼｰﾄ'!$I227,COLUMN()-15,1))","v":""},{"$f":"IF(出力ｼｰﾄ1!$AJ38=1,\"\",MID('1入力ｼｰﾄ'!$I227,COLUMN()-15,1))","v":""},{"$f":"IF(出力ｼｰﾄ1!$AJ38=1,\"\",MID('1入力ｼｰﾄ'!$I227,COLUMN()-15,1))","v":""},null,null,null,{"$f":"IF(出力ｼｰﾄ1!$AJ38=1,\"#\",MID('1入力ｼｰﾄ'!$E231,COLUMN()-22,1))","v":""},{"$f":"IF(出力ｼｰﾄ1!$AJ38=1,\"\",MID('1入力ｼｰﾄ'!$E231,COLUMN()-22,1))","v":""},null,null,null,{"$f":"IF(出力ｼｰﾄ1!$AJ38=1,\"#\",MID('1入力ｼｰﾄ'!$E231,COLUMN()-24,1))","v":""},{"$f":"IF(出力ｼｰﾄ1!$AJ38=1,\"\",MID('1入力ｼｰﾄ'!$E231,COLUMN()-24,1))","v":""},{"$f":"IF(出力ｼｰﾄ1!$AJ38=1,\"\",MID('1入力ｼｰﾄ'!$E231,COLUMN()-24,1))","v":""},{"$f":"IF(出力ｼｰﾄ1!$AJ38=1,\"\",MID('1入力ｼｰﾄ'!$E231,COLUMN()-24,1))","v":""}]
[null,null,null,null,null,null,null,null,null,"市区町\n村以降"]
[]
[null,null,null,null,null,null,null,"10",null,null,null,{"$f":"IF(出力ｼｰﾄ1!$AJ38=1,\"#\",MID('1入力ｼｰﾄ'!$E238,COLUMN()-11,1))","v":""},{"$f":"IF(出力ｼｰﾄ1!$AJ38=1,\"\",MID('1入力ｼｰﾄ'!$E238,COLUMN()-11,1))","v":""},{"$f":"IF(出力ｼｰﾄ1!$AJ38=1,\"\",MID('1入力ｼｰﾄ'!$E238,COLUMN()-11,1))","v":""},{"$f":"IF(出力ｼｰﾄ1!$AJ38=1,\"\",MID('1入力ｼｰﾄ'!$E238,COLUMN()-11,1))","v":""},{"$f":"IF(出力ｼｰﾄ1!$AJ38=1,\"\",MID('1入力ｼｰﾄ'!$E238,COLUMN()-11,1))","v":""},{"$f":"IF(出力ｼｰﾄ1!$AJ38=1,\"\",MID('1入力ｼｰﾄ'!$E238,COLUMN()-11,1))","v":""},{"$f":"IF(出力ｼｰﾄ1!$AJ38=1,\"\",MID('1入力ｼｰﾄ'!$E238,COLUMN()-11,1))","v":""},{"$f":"IF(出力ｼｰﾄ1!$AJ38=1,\"\",MID('1入力ｼｰﾄ'!$E238,COLUMN()-11,1))","v":""},{"$f":"IF(出力ｼｰﾄ1!$AJ38=1,\"\",MID('1入力ｼｰﾄ'!$E238,COLUMN()-11,1))","v":""},{"$f":"IF(出力ｼｰﾄ1!$AJ38=1,\"\",MID('1入力ｼｰﾄ'!$E238,COLUMN()-11,1))","v":""},{"$f":"IF(出力ｼｰﾄ1!$AJ38=1,\"\",MID('1入力ｼｰﾄ'!$E238,COLUMN()-11,1))","v":""},{"$f":"IF(出力ｼｰﾄ1!$AJ38=1,\"\",MID('1入力ｼｰﾄ'!$E238,COLUMN()-11,1))","v":""},{"$f":"IF(出力ｼｰﾄ1!$AJ38=1,\"\",MID('1入力ｼｰﾄ'!$E238,COLUMN()-11,1))","v":""},{"$f":"IF(出力ｼｰﾄ1!$AJ38=1,\"\",MID('1入力ｼｰﾄ'!$E238,COLUMN()-11,1))","v":""},{"$f":"IF(出力ｼｰﾄ1!$AJ38=1,\"\",MID('1入力ｼｰﾄ'!$E238,COLUMN()-11,1))","v":""},{"$f":"IF(出力ｼｰﾄ1!$AJ38=1,\"\",MID('1入力ｼｰﾄ'!$E238,COLUMN()-11,1))","v":""},{"$f":"IF(出力ｼｰﾄ1!$AJ38=1,\"\",MID('1入力ｼｰﾄ'!$E238,COLUMN()-11,1))","v":""},{"$f":"IF(出力ｼｰﾄ1!$AJ38=1,\"\",MID('1入力ｼｰﾄ'!$E238,COLUMN()-11,1))","v":""},{"$f":"IF(出力ｼｰﾄ1!$AJ38=1,\"\",MID('1入力ｼｰﾄ'!$E238,COLUMN()-11,1))","v":""},{"$f":"IF(出力ｼｰﾄ1!$AJ38=1,\"\",MID('1入力ｼｰﾄ'!$E238,COLUMN()-11,1))","v":""},{"$f":"IF(出力ｼｰﾄ1!$AJ38=1,\"\",MID('1入力ｼｰﾄ'!$E238,COLUMN()-11,1))","v":""},{"$f":"IF(出力ｼｰﾄ1!$AJ38=1,\"\",MID('1入力ｼｰﾄ'!$E238,COLUMN()-11,1))","v":""},{"$f":"IF(出力ｼｰﾄ1!$AJ38=1,\"\",MID('1入力ｼｰﾄ'!$E238,COLUMN()-11,1))","v":""},{"$f":"IF(出力ｼｰﾄ1!$AJ38=1,\"\",MID('1入力ｼｰﾄ'!$E238,COLUMN()-11,1))","v":""},{"$f":"IF(出力ｼｰﾄ1!$AJ38=1,\"\",MID('1入力ｼｰﾄ'!$E238,COLUMN()-11,1))","v":""},{"$f":"IF(出力ｼｰﾄ1!$AJ38=1,\"\",MID('1入力ｼｰﾄ'!$E238,COLUMN()-11,1))","v":""},{"$f":"IF(出力ｼｰﾄ1!$AJ38=1,\"\",MID('1入力ｼｰﾄ'!$E238,COLUMN()-11,1))","v":""},{"$f":"IF(出力ｼｰﾄ1!$AJ38=1,\"\",MID('1入力ｼｰﾄ'!$E238,COLUMN()-11,1))","v":""},{"$f":"IF(出力ｼｰﾄ1!$AJ38=1,\"\",MID('1入力ｼｰﾄ'!$E238,COLUMN()-11,1))","v":""},{"$f":"IF(出力ｼｰﾄ1!$AJ38=1,\"\",MID('1入力ｼｰﾄ'!$E238,COLUMN()-11,1))","v":""},{"$f":"IF(出力ｼｰﾄ1!$AJ38=1,\"\",MID('1入力ｼｰﾄ'!$E238,COLUMN()-11,1))","v":""},{"$f":"IF(出力ｼｰﾄ1!$AJ38=1,\"\",MID('1入力ｼｰﾄ'!$E238,COLUMN()-11,1))","v":""},{"$f":"IF(出力ｼｰﾄ1!$AJ38=1,\"\",MID('1入力ｼｰﾄ'!$E238,COLUMN()-11,1))","v":""},{"$f":"IF(出力ｼｰﾄ1!$AJ38=1,\"\",MID('1入力ｼｰﾄ'!$E238,COLUMN()-11,1))","v":""},{"$f":"IF(出力ｼｰﾄ1!$AJ38=1,\"\",MID('1入力ｼｰﾄ'!$E238,COLUMN()-11,1))","v":""},{"$f":"IF(出力ｼｰﾄ1!$AJ38=1,\"\",MID('1入力ｼｰﾄ'!$E238,COLUMN()-11,1))","v":""},{"$f":"IF(出力ｼｰﾄ1!$AJ38=1,\"\",MID('1入力ｼｰﾄ'!$E238,COLUMN()-11,1))","v":""},{"$f":"IF(出力ｼｰﾄ1!$AJ38=1,\"\",MID('1入力ｼｰﾄ'!$E238,COLUMN()-11,1))","v":""},{"$f":"IF(出力ｼｰﾄ1!$AJ38=1,\"\",MID('1入力ｼｰﾄ'!$E238,COLUMN()-11,1))","v":""},{"$f":"IF(出力ｼｰﾄ1!$AJ38=1,\"\",MID('1入力ｼｰﾄ'!$E238,COLUMN()-11,1))","v":""},{"$f":"IF(出力ｼｰﾄ1!$AJ38=1,\"\",MID('1入力ｼｰﾄ'!$E238,COLUMN()-11,1))","v":""},{"$f":"IF(出力ｼｰﾄ1!$AJ38=1,\"\",MID('1入力ｼｰﾄ'!$E238,COLUMN()-11,1))","v":""},{"$f":"IF(出力ｼｰﾄ1!$AJ38=1,\"\",MID('1入力ｼｰﾄ'!$E238,COLUMN()-11,1))","v":""},{"$f":"IF(出力ｼｰﾄ1!$AJ38=1,\"\",MID('1入力ｼｰﾄ'!$E238,COLUMN()-11,1))","v":""},{"$f":"IF(出力ｼｰﾄ1!$AJ38=1,\"\",MID('1入力ｼｰﾄ'!$E238,COLUMN()-11,1))","v":""},{"$f":"IF(出力ｼｰﾄ1!$AJ38=1,\"\",MID('1入力ｼｰﾄ'!$E238,COLUMN()-11,1))","v":""},{"$f":"IF(出力ｼｰﾄ1!$AJ38=1,\"\",MID('1入力ｼｰﾄ'!$E238,COLUMN()-11,1))","v":""},{"$f":"IF(出力ｼｰﾄ1!$AJ38=1,\"\",MID('1入力ｼｰﾄ'!$E238,COLUMN()-11,1))","v":""},{"$f":"IF(出力ｼｰﾄ1!$AJ38=1,\"\",MID('1入力ｼｰﾄ'!$E238,COLUMN()-11,1))","v":""},{"$f":"IF(出力ｼｰﾄ1!$AJ38=1,\"\",MID('1入力ｼｰﾄ'!$E238,COLUMN()-11,1))","v":""},{"$f":"IF(出力ｼｰﾄ1!$AJ38=1,\"\",MID('1入力ｼｰﾄ'!$E238,COLUMN()-11,1))","v":""},{"$f":"IF(出力ｼｰﾄ1!$AJ38=1,\"\",MID('1入力ｼｰﾄ'!$E238,COLUMN()-11,1))","v":""},{"$f":"IF(出力ｼｰﾄ1!$AJ38=1,\"\",MID('1入力ｼｰﾄ'!$E238,COLUMN()-11,1))","v":""},{"$f":"IF(出力ｼｰﾄ1!$AJ38=1,\"\",MID('1入力ｼｰﾄ'!$E238,COLUMN()-11,1))","v":""},{"$f":"IF(出力ｼｰﾄ1!$AJ38=1,\"\",MID('1入力ｼｰﾄ'!$E238,COLUMN()-11,1))","v":""}]
[null,null,"受任者",null,null,null,null,null,null,"役職\n(漢字)",null,null,null,null,null,null,null,null,null,null,null,null,null,null,null,null,null,null,null,null,null,null,null,null,null,null,null,null,null,null,null,"氏名\n(漢字）"]
[]
[null,null,null,null,null,null,null,"11",null,null,null,{"$f":"IF(出力ｼｰﾄ1!$AJ38=1,\"#\",MID('1入力ｼｰﾄ'!$E249,COLUMN()-11,1))","v":""},{"$f":"IF(出力ｼｰﾄ1!$AJ38=1,\"\",MID('1入力ｼｰﾄ'!$E249,COLUMN()-11,1))","v":""},{"$f":"IF(出力ｼｰﾄ1!$AJ38=1,\"\",MID('1入力ｼｰﾄ'!$E249,COLUMN()-11,1))","v":""},{"$f":"IF(出力ｼｰﾄ1!$AJ38=1,\"\",MID('1入力ｼｰﾄ'!$E249,COLUMN()-11,1))","v":""},{"$f":"IF(出力ｼｰﾄ1!$AJ38=1,\"\",MID('1入力ｼｰﾄ'!$E249,COLUMN()-11,1))","v":""},{"$f":"IF(出力ｼｰﾄ1!$AJ38=1,\"\",MID('1入力ｼｰﾄ'!$E249,COLUMN()-11,1))","v":""},{"$f":"IF(出力ｼｰﾄ1!$AJ38=1,\"\",MID('1入力ｼｰﾄ'!$E249,COLUMN()-11,1))","v":""},{"$f":"IF(出力ｼｰﾄ1!$AJ38=1,\"\",MID('1入力ｼｰﾄ'!$E249,COLUMN()-11,1))","v":""},{"$f":"IF(出力ｼｰﾄ1!$AJ38=1,\"\",MID('1入力ｼｰﾄ'!$E249,COLUMN()-11,1))","v":""},{"$f":"IF(出力ｼｰﾄ1!$AJ38=1,\"\",MID('1入力ｼｰﾄ'!$E249,COLUMN()-11,1))","v":""},{"$f":"IF(出力ｼｰﾄ1!$AJ38=1,\"\",MID('1入力ｼｰﾄ'!$E249,COLUMN()-11,1))","v":""},{"$f":"IF(出力ｼｰﾄ1!$AJ38=1,\"\",MID('1入力ｼｰﾄ'!$E249,COLUMN()-11,1))","v":""},{"$f":"IF(出力ｼｰﾄ1!$AJ38=1,\"\",MID('1入力ｼｰﾄ'!$E249,COLUMN()-11,1))","v":""},{"$f":"IF(出力ｼｰﾄ1!$AJ38=1,\"\",MID('1入力ｼｰﾄ'!$E249,COLUMN()-11,1))","v":""},{"$f":"IF(出力ｼｰﾄ1!$AJ38=1,\"\",MID('1入力ｼｰﾄ'!$E249,COLUMN()-11,1))","v":""},{"$f":"IF(出力ｼｰﾄ1!$AJ38=1,\"\",MID('1入力ｼｰﾄ'!$E249,COLUMN()-11,1))","v":""},{"$f":"IF(出力ｼｰﾄ1!$AJ38=1,\"\",MID('1入力ｼｰﾄ'!$E249,COLUMN()-11,1))","v":""},{"$f":"IF(出力ｼｰﾄ1!$AJ38=1,\"\",MID('1入力ｼｰﾄ'!$E249,COLUMN()-11,1))","v":""},{"$f":"IF(出力ｼｰﾄ1!$AJ38=1,\"\",MID('1入力ｼｰﾄ'!$E249,COLUMN()-11,1))","v":""},{"$f":"IF(出力ｼｰﾄ1!$AJ38=1,\"\",MID('1入力ｼｰﾄ'!$E249,COLUMN()-11,1))","v":""},{"$f":"IF(出力ｼｰﾄ1!$AJ38=1,\"\",MID('1入力ｼｰﾄ'!$E249,COLUMN()-11,1))","v":""},{"$f":"IF(出力ｼｰﾄ1!$AJ38=1,\"\",MID('1入力ｼｰﾄ'!$E249,COLUMN()-11,1))","v":""},{"$f":"IF(出力ｼｰﾄ1!$AJ38=1,\"\",MID('1入力ｼｰﾄ'!$E249,COLUMN()-11,1))","v":""},{"$f":"IF(出力ｼｰﾄ1!$AJ38=1,\"\",MID('1入力ｼｰﾄ'!$E249,COLUMN()-11,1))","v":""},{"$f":"IF(出力ｼｰﾄ1!$AJ38=1,\"\",MID('1入力ｼｰﾄ'!$E249,COLUMN()-11,1))","v":""},{"$f":"IF(出力ｼｰﾄ1!$AJ38=1,\"\",MID('1入力ｼｰﾄ'!$E249,COLUMN()-11,1))","v":""},{"$f":"IF(出力ｼｰﾄ1!$AJ38=1,\"\",MID('1入力ｼｰﾄ'!$E249,COLUMN()-11,1))","v":""},{"$f":"IF(出力ｼｰﾄ1!$AJ38=1,\"\",MID('1入力ｼｰﾄ'!$E249,COLUMN()-11,1))","v":""},{"$f":"IF(出力ｼｰﾄ1!$AJ38=1,\"\",MID('1入力ｼｰﾄ'!$E249,COLUMN()-11,1))","v":""},{"$f":"IF(出力ｼｰﾄ1!$AJ38=1,\"\",MID('1入力ｼｰﾄ'!$E249,COLUMN()-11,1))","v":""},null,null,{"$f":"IF(出力ｼｰﾄ1!$AJ38=1,\"#\",MID('1入力ｼｰﾄ'!$E254,COLUMN()-43,1))","v":""},{"$f":"IF(出力ｼｰﾄ1!$AJ38=1,\"\",MID('1入力ｼｰﾄ'!$E254,COLUMN()-43,1))","v":""},{"$f":"IF(出力ｼｰﾄ1!$AJ38=1,\"\",MID('1入力ｼｰﾄ'!$E254,COLUMN()-43,1))","v":""},{"$f":"IF(出力ｼｰﾄ1!$AJ38=1,\"\",MID('1入力ｼｰﾄ'!$E254,COLUMN()-43,1))","v":""},{"$f":"IF(出力ｼｰﾄ1!$AJ38=1,\"\",MID('1入力ｼｰﾄ'!$E254,COLUMN()-43,1))","v":""},{"$f":"IF(出力ｼｰﾄ1!$AJ38=1,\"\",MID('1入力ｼｰﾄ'!$E254,COLUMN()-43,1))","v":""},{"$f":"IF(出力ｼｰﾄ1!$AJ38=1,\"\",MID('1入力ｼｰﾄ'!$E254,COLUMN()-43,1))","v":""},{"$f":"IF(出力ｼｰﾄ1!$AJ38=1,\"\",MID('1入力ｼｰﾄ'!$E254,COLUMN()-43,1))","v":""},{"$f":"IF(出力ｼｰﾄ1!$AJ38=1,\"\",MID('1入力ｼｰﾄ'!$E254,COLUMN()-43,1))","v":""},{"$f":"IF(出力ｼｰﾄ1!$AJ38=1,\"\",MID('1入力ｼｰﾄ'!$E254,COLUMN()-43,1))","v":""},{"$f":"IF(出力ｼｰﾄ1!$AJ38=1,\"\",MID('1入力ｼｰﾄ'!$E254,COLUMN()-43,1))","v":""},{"$f":"IF(出力ｼｰﾄ1!$AJ38=1,\"\",MID('1入力ｼｰﾄ'!$E254,COLUMN()-43,1))","v":""},{"$f":"IF(出力ｼｰﾄ1!$AJ38=1,\"\",MID('1入力ｼｰﾄ'!$E254,COLUMN()-43,1))","v":""},{"$f":"IF(出力ｼｰﾄ1!$AJ38=1,\"\",MID('1入力ｼｰﾄ'!$E254,COLUMN()-43,1))","v":""},{"$f":"IF(出力ｼｰﾄ1!$AJ38=1,\"\",MID('1入力ｼｰﾄ'!$E254,COLUMN()-43,1))","v":""},{"$f":"IF(出力ｼｰﾄ1!$AJ38=1,\"\",MID('1入力ｼｰﾄ'!$E254,COLUMN()-43,1))","v":""},{"$f":"IF(出力ｼｰﾄ1!$AJ38=1,\"\",MID('1入力ｼｰﾄ'!$E254,COLUMN()-43,1))","v":""},{"$f":"IF(出力ｼｰﾄ1!$AJ38=1,\"\",MID('1入力ｼｰﾄ'!$E254,COLUMN()-43,1))","v":""},{"$f":"IF(出力ｼｰﾄ1!$AJ38=1,\"\",MID('1入力ｼｰﾄ'!$E254,COLUMN()-43,1))","v":""},{"$f":"IF(出力ｼｰﾄ1!$AJ38=1,\"\",MID('1入力ｼｰﾄ'!$E254,COLUMN()-43,1))","v":""}]
[]
[]
[]
[null,"連　絡　先",null,null,null,null,"電　話\n番　号",null,null,null,null,null,null,null,null,null,null,null,null,null,null,null,null,null,null,null,"ＦＡＸ\n番 号"]
[]
[null,null,null,null,null,null,null,null,null,"１２",null,{"$f":"MID(出力ｼｰﾄ1!$AJ49,COLUMN()-11,1)","v":""},{"$f":"MID(出力ｼｰﾄ1!$AJ49,COLUMN()-11,1)","v":""},{"$f":"MID(出力ｼｰﾄ1!$AJ49,COLUMN()-11,1)","v":""},{"$f":"MID(出力ｼｰﾄ1!$AJ49,COLUMN()-11,1)","v":""},{"$f":"MID(出力ｼｰﾄ1!$AJ49,COLUMN()-11,1)","v":""},{"$f":"MID(出力ｼｰﾄ1!$AJ49,COLUMN()-11,1)","v":""},{"$f":"MID(出力ｼｰﾄ1!$AJ49,COLUMN()-11,1)","v":""},{"$f":"MID(出力ｼｰﾄ1!$AJ49,COLUMN()-11,1)","v":""},{"$f":"MID(出力ｼｰﾄ1!$AJ49,COLUMN()-11,1)","v":""},{"$f":"MID(出力ｼｰﾄ1!$AJ49,COLUMN()-11,1)","v":""},{"$f":"MID(出力ｼｰﾄ1!$AJ49,COLUMN()-11,1)","v":""},{"$f":"MID(出力ｼｰﾄ1!$AJ49,COLUMN()-11,1)","v":""},{"$f":"MID(出力ｼｰﾄ1!$AJ49,COLUMN()-11,1)","v":""},{"$f":"MID(出力ｼｰﾄ1!$AJ49,COLUMN()-11,1)","v":""},{"$f":"MID(出力ｼｰﾄ1!$AJ49,COLUMN()-11,1)","v":""},null,null,null,{"$f":"MID(出力ｼｰﾄ1!$AJ50,COLUMN()-29,1)","v":""},{"$f":"MID(出力ｼｰﾄ1!$AJ50,COLUMN()-29,1)","v":""},{"$f":"MID(出力ｼｰﾄ1!$AJ50,COLUMN()-29,1)","v":""},{"$f":"MID(出力ｼｰﾄ1!$AJ50,COLUMN()-29,1)","v":""},{"$f":"MID(出力ｼｰﾄ1!$AJ50,COLUMN()-29,1)","v":""},{"$f":"MID(出力ｼｰﾄ1!$AJ50,COLUMN()-29,1)","v":""},{"$f":"MID(出力ｼｰﾄ1!$AJ50,COLUMN()-29,1)","v":""},{"$f":"MID(出力ｼｰﾄ1!$AJ50,COLUMN()-29,1)","v":""},{"$f":"MID(出力ｼｰﾄ1!$AJ50,COLUMN()-29,1)","v":""},{"$f":"MID(出力ｼｰﾄ1!$AJ50,COLUMN()-29,1)","v":""},{"$f":"MID(出力ｼｰﾄ1!$AJ50,COLUMN()-29,1)","v":""},{"$f":"MID(出力ｼｰﾄ1!$AJ50,COLUMN()-29,1)","v":""},{"$f":"MID(出力ｼｰﾄ1!$AJ50,COLUMN()-29,1)","v":""},{"$f":"MID(出力ｼｰﾄ1!$AJ50,COLUMN()-29,1)","v":""},{"$f":"MID(出力ｼｰﾄ1!$AJ50,COLUMN()-29,1)","v":""}]
[]
[null,null,null,null,null,null,null,null,null,null,null,null,null,null,null,null,null,null,null,null,null,null,null,null,null,null,null,null,null,null,null,null,null,null,null,null,null,null,null,null,null,null,null,null,null,null,null,null,null,null,null,null,null,null,null,null,null,null,{"$f":"'1入力ｼｰﾄ'!N316","v":""},null,null,null,{"$f":"'1入力ｼｰﾄ'!U316","v":""}]
[]
[]
[null,null,null,null,null,null,null,null,null,null,null,null,null,null,null,null,null,null,null,null,null,null,null,null,null,null,null,null,null,null,null,null,null,null,null,null,null,null,null,null,null,null,null,null,null,null,null,null,null,null,null,null,null,null,null,null,null,null,null,null,null,"Ｎｏ．２"]
[]
[null,"受付番号",null,null,null,null,null,null,null,null,null,"業者番号",null,null,null,null,null,null,null,null,null,null,null,null,null,null,null,null,null,null,null,null,null,null,null,null,"業者名称（本店）"]
[null,null,null,null,null,{"$f":"MID('1入力ｼｰﾄ'!$E52,COLUMN()-5,1)","v":""},{"$f":"MID('1入力ｼｰﾄ'!$E52,COLUMN()-5,1)","v":""},{"$f":"MID('1入力ｼｰﾄ'!$E52,COLUMN()-5,1)","v":""},{"$f":"MID('1入力ｼｰﾄ'!$E52,COLUMN()-5,1)","v":""},null,null,null,null,null,null,{"$f":"MID(出力ｼｰﾄ1!$L9,COLUMN()-15,1)","v":""},{"$f":"MID(出力ｼｰﾄ1!$L9,COLUMN()-15,1)","v":""},{"$f":"MID(出力ｼｰﾄ1!$L9,COLUMN()-15,1)","v":""},{"$f":"MID(出力ｼｰﾄ1!$L9,COLUMN()-15,1)","v":""},{"$f":"MID(出力ｼｰﾄ1!$L9,COLUMN()-15,1)","v":""},{"$f":"MID(出力ｼｰﾄ1!$L9,COLUMN()-15,1)","v":""},{"$f":"MID(出力ｼｰﾄ1!$L9,COLUMN()-15,1)","v":""},{"$f":"MID(出力ｼｰﾄ1!$L9,COLUMN()-15,1)","v":""},{"$f":"MID(出力ｼｰﾄ1!$L9,COLUMN()-15,1)","v":""}]
[null,null,null,null,null,null,null,null,null,null,null,null,null,null,null,null,null,null,null,null,null,null,null,null,null,null,null,null,null,null,null,null,null,null,null,null,{"$f":"IF('1入力ｼｰﾄ'!E96=0,\"\",'1入力ｼｰﾄ'!E96)","v":""}]
[null,"申請種目",null,null,null,null,"資格区分",null,null,"大分類",null,null,null,null,"小分類"]
[null,null,null,null,null,null,null,null,null,null,null,null,null,null,"第1希望",null,null,"第2希望",null,null,"第3希望"]
[null,null,null,null,13,null,"012",null,null,"第1希望"]
[null,null,null,null,null,null,null,null,null,null,null,{"$f":"IF(出力ｼｰﾄ1!$AM46=\"error\",\"\",MID('1入力ｼｰﾄ'!$B293,COLUMN()-11,1))","v":""},{"$f":"IF(出力ｼｰﾄ1!$AM46=\"error\",\"\",MID('1入力ｼｰﾄ'!$B293,COLUMN()-11,1))","v":""},{"$f":"IF(出力ｼｰﾄ1!$AM46=\"error\",\"\",MID('1入力ｼｰﾄ'!$B293,COLUMN()-11,1))","v":""},{"$f":"IF(出力ｼｰﾄ1!$AM46=\"error\",\"\",MID('1入力ｼｰﾄ'!$I293,COLUMN()-14,1))","v":""},{"$f":"IF(出力ｼｰﾄ1!$AM46=\"error\",\"\",MID('1入力ｼｰﾄ'!$I293,COLUMN()-14,1))","v":""},{"$f":"IF(出力ｼｰﾄ1!$AM46=\"error\",\"\",MID('1入力ｼｰﾄ'!$I293,COLUMN()-14,1))","v":""},{"$f":"IF(出力ｼｰﾄ1!$AM46=\"error\",\"\",MID('1入力ｼｰﾄ'!$S293,COLUMN()-17,1))","v":""},{"$f":"IF(出力ｼｰﾄ1!$AM46=\"error\",\"\",MID('1入力ｼｰﾄ'!$S293,COLUMN()-17,1))","v":""},{"$f":"IF(出力ｼｰﾄ1!$AM46=\"error\",\"\",MID('1入力ｼｰﾄ'!$S293,COLUMN()-17,1))","v":""},{"$f":"IF(出力ｼｰﾄ1!$AM46=\"error\",\"\",MID('1入力ｼｰﾄ'!$AC293,COLUMN()-20,1))","v":""},{"$f":"IF(出力ｼｰﾄ1!$AM46=\"error\",\"\",MID('1入力ｼｰﾄ'!$AC293,COLUMN()-20,1))","v":""},{"$f":"IF(出力ｼｰﾄ1!$AM46=\"error\",\"\",MID('1入力ｼｰﾄ'!$AC293,COLUMN()-20,1))","v":""}]
[null,null,null,null,14,null,"012",null,null,"第2希望"]
[null,null,null,null,null,null,null,null,null,null,null,{"$f":"IF(出力ｼｰﾄ1!$AM46=\"error\",\"\",MID('1入力ｼｰﾄ'!$B295,COLUMN()-11,1))","v":""},{"$f":"IF(出力ｼｰﾄ1!$AM46=\"error\",\"\",MID('1入力ｼｰﾄ'!$B295,COLUMN()-11,1))","v":""},{"$f":"IF(出力ｼｰﾄ1!$AM46=\"error\",\"\",MID('1入力ｼｰﾄ'!$B295,COLUMN()-11,1))","v":""},{"$f":"IF(出力ｼｰﾄ1!$AM46=\"error\",\"\",MID('1入力ｼｰﾄ'!$I295,COLUMN()-14,1))","v":""},{"$f":"IF(出力ｼｰﾄ1!$AM46=\"error\",\"\",MID('1入力ｼｰﾄ'!$I295,COLUMN()-14,1))","v":""},{"$f":"IF(出力ｼｰﾄ1!$AM46=\"error\",\"\",MID('1入力ｼｰﾄ'!$I295,COLUMN()-14,1))","v":""},{"$f":"IF(出力ｼｰﾄ1!$AM46=\"error\",\"\",MID('1入力ｼｰﾄ'!$S295,COLUMN()-17,1))","v":""},{"$f":"IF(出力ｼｰﾄ1!$AM46=\"error\",\"\",MID('1入力ｼｰﾄ'!$S295,COLUMN()-17,1))","v":""},{"$f":"IF(出力ｼｰﾄ1!$AM46=\"error\",\"\",MID('1入力ｼｰﾄ'!$S295,COLUMN()-17,1))","v":""},{"$f":"IF(出力ｼｰﾄ1!$AM46=\"error\",\"\",MID('1入力ｼｰﾄ'!$AC295,COLUMN()-20,1))","v":""},{"$f":"IF(出力ｼｰﾄ1!$AM46=\"error\",\"\",MID('1入力ｼｰﾄ'!$AC295,COLUMN()-20,1))","v":""},{"$f":"IF(出力ｼｰﾄ1!$AM46=\"error\",\"\",MID('1入力ｼｰﾄ'!$AC295,COLUMN()-20,1))","v":""}]
[null,null,null,null,15,null,"012",null,null,"第3希望"]
[null,null,null,null,null,null,null,null,null,null,null,{"$f":"IF(出力ｼｰﾄ1!$AM46=\"error\",\"\",MID('1入力ｼｰﾄ'!$B297,COLUMN()-11,1))","v":""},{"$f":"IF(出力ｼｰﾄ1!$AM46=\"error\",\"\",MID('1入力ｼｰﾄ'!$B297,COLUMN()-11,1))","v":""},{"$f":"IF(出力ｼｰﾄ1!$AM46=\"error\",\"\",MID('1入力ｼｰﾄ'!$B297,COLUMN()-11,1))","v":""},{"$f":"IF(出力ｼｰﾄ1!$AM46=\"error\",\"\",MID('1入力ｼｰﾄ'!$I297,COLUMN()-14,1))","v":""},{"$f":"IF(出力ｼｰﾄ1!$AM46=\"error\",\"\",MID('1入力ｼｰﾄ'!$I297,COLUMN()-14,1))","v":""},{"$f":"IF(出力ｼｰﾄ1!$AM46=\"error\",\"\",MID('1入力ｼｰﾄ'!$I297,COLUMN()-14,1))","v":""},{"$f":"IF(出力ｼｰﾄ1!$AM46=\"error\",\"\",MID('1入力ｼｰﾄ'!$S297,COLUMN()-17,1))","v":""},{"$f":"IF(出力ｼｰﾄ1!$AM46=\"error\",\"\",MID('1入力ｼｰﾄ'!$S297,COLUMN()-17,1))","v":""},{"$f":"IF(出力ｼｰﾄ1!$AM46=\"error\",\"\",MID('1入力ｼｰﾄ'!$S297,COLUMN()-17,1))","v":""},{"$f":"IF(出力ｼｰﾄ1!$AM46=\"error\",\"\",MID('1入力ｼｰﾄ'!$AC297,COLUMN()-20,1))","v":""},{"$f":"IF(出力ｼｰﾄ1!$AM46=\"error\",\"\",MID('1入力ｼｰﾄ'!$AC297,COLUMN()-20,1))","v":""},{"$f":"IF(出力ｼｰﾄ1!$AM46=\"error\",\"\",MID('1入力ｼｰﾄ'!$AC297,COLUMN()-20,1))","v":""}]
[null,null,null,null,16,null,"012",null,null,"第4希望"]
[null,null,null,null,null,null,null,null,null,null,null,{"$f":"IF(出力ｼｰﾄ1!$AM46=\"error\",\"\",MID('1入力ｼｰﾄ'!$B299,COLUMN()-11,1))","v":""},{"$f":"IF(出力ｼｰﾄ1!$AM46=\"error\",\"\",MID('1入力ｼｰﾄ'!$B299,COLUMN()-11,1))","v":""},{"$f":"IF(出力ｼｰﾄ1!$AM46=\"error\",\"\",MID('1入力ｼｰﾄ'!$B299,COLUMN()-11,1))","v":""},{"$f":"IF(出力ｼｰﾄ1!$AM46=\"error\",\"\",MID('1入力ｼｰﾄ'!$I299,COLUMN()-14,1))","v":""},{"$f":"IF(出力ｼｰﾄ1!$AM46=\"error\",\"\",MID('1入力ｼｰﾄ'!$I299,COLUMN()-14,1))","v":""},{"$f":"IF(出力ｼｰﾄ1!$AM46=\"error\",\"\",MID('1入力ｼｰﾄ'!$I299,COLUMN()-14,1))","v":""},{"$f":"IF(出力ｼｰﾄ1!$AM46=\"error\",\"\",MID('1入力ｼｰﾄ'!$S299,COLUMN()-17,1))","v":""},{"$f":"IF(出力ｼｰﾄ1!$AM46=\"error\",\"\",MID('1入力ｼｰﾄ'!$S299,COLUMN()-17,1))","v":""},{"$f":"IF(出力ｼｰﾄ1!$AM46=\"error\",\"\",MID('1入力ｼｰﾄ'!$S299,COLUMN()-17,1))","v":""},{"$f":"IF(出力ｼｰﾄ1!$AM46=\"error\",\"\",MID('1入力ｼｰﾄ'!$AC299,COLUMN()-20,1))","v":""},{"$f":"IF(出力ｼｰﾄ1!$AM46=\"error\",\"\",MID('1入力ｼｰﾄ'!$AC299,COLUMN()-20,1))","v":""},{"$f":"IF(出力ｼｰﾄ1!$AM46=\"error\",\"\",MID('1入力ｼｰﾄ'!$AC299,COLUMN()-20,1))","v":""}]
[null,null,null,null,17,null,"012",null,null,"第5希望"]
[null,null,null,null,null,null,null,null,null,null,null,{"$f":"IF(出力ｼｰﾄ1!$AM46=\"error\",\"\",MID('1入力ｼｰﾄ'!$B301,COLUMN()-11,1))","v":""},{"$f":"IF(出力ｼｰﾄ1!$AM46=\"error\",\"\",MID('1入力ｼｰﾄ'!$B301,COLUMN()-11,1))","v":""},{"$f":"IF(出力ｼｰﾄ1!$AM46=\"error\",\"\",MID('1入力ｼｰﾄ'!$B301,COLUMN()-11,1))","v":""},{"$f":"IF(出力ｼｰﾄ1!$AM46=\"error\",\"\",MID('1入力ｼｰﾄ'!$I301,COLUMN()-14,1))","v":""},{"$f":"IF(出力ｼｰﾄ1!$AM46=\"error\",\"\",MID('1入力ｼｰﾄ'!$I301,COLUMN()-14,1))","v":""},{"$f":"IF(出力ｼｰﾄ1!$AM46=\"error\",\"\",MID('1入力ｼｰﾄ'!$I301,COLUMN()-14,1))","v":""},{"$f":"IF(出力ｼｰﾄ1!$AM46=\"error\",\"\",MID('1入力ｼｰﾄ'!$S301,COLUMN()-17,1))","v":""},{"$f":"IF(出力ｼｰﾄ1!$AM46=\"error\",\"\",MID('1入力ｼｰﾄ'!$S301,COLUMN()-17,1))","v":""},{"$f":"IF(出力ｼｰﾄ1!$AM46=\"error\",\"\",MID('1入力ｼｰﾄ'!$S301,COLUMN()-17,1))","v":""},{"$f":"IF(出力ｼｰﾄ1!$AM46=\"error\",\"\",MID('1入力ｼｰﾄ'!$AC301,COLUMN()-20,1))","v":""},{"$f":"IF(出力ｼｰﾄ1!$AM46=\"error\",\"\",MID('1入力ｼｰﾄ'!$AC301,COLUMN()-20,1))","v":""},{"$f":"IF(出力ｼｰﾄ1!$AM46=\"error\",\"\",MID('1入力ｼｰﾄ'!$AC301,COLUMN()-20,1))","v":""}]
[]
[null,null,null,null,null,null,null,null,null,null,null,{"$f":"IF(出力ｼｰﾄ1!$AM46=\"error\",\"\",MID('1入力ｼｰﾄ'!$B303,COLUMN()-11,1))","v":""},{"$f":"IF(出力ｼｰﾄ1!$AM46=\"error\",\"\",MID('1入力ｼｰﾄ'!$B303,COLUMN()-11,1))","v":""},{"$f":"IF(出力ｼｰﾄ1!$AM46=\"error\",\"\",MID('1入力ｼｰﾄ'!$B303,COLUMN()-11,1))","v":""},{"$f":"IF(出力ｼｰﾄ1!$AM46=\"error\",\"\",MID('1入力ｼｰﾄ'!$I303,COLUMN()-14,1))","v":""},{"$f":"IF(出力ｼｰﾄ1!$AM46=\"error\",\"\",MID('1入力ｼｰﾄ'!$I303,COLUMN()-14,1))","v":""},{"$f":"IF(出力ｼｰﾄ1!$AM46=\"error\",\"\",MID('1入力ｼｰﾄ'!$I303,COLUMN()-14,1))","v":""},{"$f":"IF(出力ｼｰﾄ1!$AM46=\"error\",\"\",MID('1入力ｼｰﾄ'!$S303,COLUMN()-17,1))","v":""},{"$f":"IF(出力ｼｰﾄ1!$AM46=\"error\",\"\",MID('1入力ｼｰﾄ'!$S303,COLUMN()-17,1))","v":""},{"$f":"IF(出力ｼｰﾄ1!$AM46=\"error\",\"\",MID('1入力ｼｰﾄ'!$S303,COLUMN()-17,1))","v":""},{"$f":"IF(出力ｼｰﾄ1!$AM46=\"error\",\"\",MID('1入力ｼｰﾄ'!$AC303,COLUMN()-20,1))","v":""},{"$f":"IF(出力ｼｰﾄ1!$AM46=\"error\",\"\",MID('1入力ｼｰﾄ'!$AC303,COLUMN()-20,1))","v":""},{"$f":"IF(出力ｼｰﾄ1!$AM46=\"error\",\"\",MID('1入力ｼｰﾄ'!$AC303,COLUMN()-20,1))","v":""}]
[]
[]
[null,null,null,null,null,null,null,null,"取扱い品目・業務内容等（漢字）"]
[null,"取扱い\n品目",null,18,"大分類第1希望\n小分類第1希望"]
[null,null,null,null,null,null,null,null,{"$f":"MID('2主要取扱品目（業務）名表入力ｼｰﾄ（兼出力ｼｰﾄ）'!$AY36,COLUMN()-8,1)","v":""},{"$f":"MID('2主要取扱品目（業務）名表入力ｼｰﾄ（兼出力ｼｰﾄ）'!$AY36,COLUMN()-8,1)","v":""},{"$f":"MID('2主要取扱品目（業務）名表入力ｼｰﾄ（兼出力ｼｰﾄ）'!$AY36,COLUMN()-8,1)","v":""},{"$f":"MID('2主要取扱品目（業務）名表入力ｼｰﾄ（兼出力ｼｰﾄ）'!$AY36,COLUMN()-8,1)","v":""},{"$f":"MID('2主要取扱品目（業務）名表入力ｼｰﾄ（兼出力ｼｰﾄ）'!$AY36,COLUMN()-8,1)","v":""},{"$f":"MID('2主要取扱品目（業務）名表入力ｼｰﾄ（兼出力ｼｰﾄ）'!$AY36,COLUMN()-8,1)","v":""},{"$f":"MID('2主要取扱品目（業務）名表入力ｼｰﾄ（兼出力ｼｰﾄ）'!$AY36,COLUMN()-8,1)","v":""},{"$f":"MID('2主要取扱品目（業務）名表入力ｼｰﾄ（兼出力ｼｰﾄ）'!$AY36,COLUMN()-8,1)","v":""},{"$f":"MID('2主要取扱品目（業務）名表入力ｼｰﾄ（兼出力ｼｰﾄ）'!$AY36,COLUMN()-8,1)","v":""},{"$f":"MID('2主要取扱品目（業務）名表入力ｼｰﾄ（兼出力ｼｰﾄ）'!$AY36,COLUMN()-8,1)","v":""},{"$f":"MID('2主要取扱品目（業務）名表入力ｼｰﾄ（兼出力ｼｰﾄ）'!$AY36,COLUMN()-8,1)","v":""},{"$f":"MID('2主要取扱品目（業務）名表入力ｼｰﾄ（兼出力ｼｰﾄ）'!$AY36,COLUMN()-8,1)","v":""},{"$f":"MID('2主要取扱品目（業務）名表入力ｼｰﾄ（兼出力ｼｰﾄ）'!$AY36,COLUMN()-8,1)","v":""},{"$f":"MID('2主要取扱品目（業務）名表入力ｼｰﾄ（兼出力ｼｰﾄ）'!$AY36,COLUMN()-8,1)","v":""},{"$f":"MID('2主要取扱品目（業務）名表入力ｼｰﾄ（兼出力ｼｰﾄ）'!$AY36,COLUMN()-8,1)","v":""},{"$f":"MID('2主要取扱品目（業務）名表入力ｼｰﾄ（兼出力ｼｰﾄ）'!$AY36,COLUMN()-8,1)","v":""},{"$f":"MID('2主要取扱品目（業務）名表入力ｼｰﾄ（兼出力ｼｰﾄ）'!$AY36,COLUMN()-8,1)","v":""},{"$f":"MID('2主要取扱品目（業務）名表入力ｼｰﾄ（兼出力ｼｰﾄ）'!$AY36,COLUMN()-8,1)","v":""},{"$f":"MID('2主要取扱品目（業務）名表入力ｼｰﾄ（兼出力ｼｰﾄ）'!$AY36,COLUMN()-8,1)","v":""},{"$f":"MID('2主要取扱品目（業務）名表入力ｼｰﾄ（兼出力ｼｰﾄ）'!$AY36,COLUMN()-8,1)","v":""},{"$f":"MID('2主要取扱品目（業務）名表入力ｼｰﾄ（兼出力ｼｰﾄ）'!$AY36,COLUMN()-8,1)","v":""},{"$f":"MID('2主要取扱品目（業務）名表入力ｼｰﾄ（兼出力ｼｰﾄ）'!$AY36,COLUMN()-8,1)","v":""},{"$f":"MID('2主要取扱品目（業務）名表入力ｼｰﾄ（兼出力ｼｰﾄ）'!$AY36,COLUMN()-8,1)","v":""},{"$f":"MID('2主要取扱品目（業務）名表入力ｼｰﾄ（兼出力ｼｰﾄ）'!$AY36,COLUMN()-8,1)","v":""},{"$f":"MID('2主要取扱品目（業務）名表入力ｼｰﾄ（兼出力ｼｰﾄ）'!$AY36,COLUMN()-8,1)","v":""},{"$f":"MID('2主要取扱品目（業務）名表入力ｼｰﾄ（兼出力ｼｰﾄ）'!$AY36,COLUMN()-8,1)","v":""},{"$f":"MID('2主要取扱品目（業務）名表入力ｼｰﾄ（兼出力ｼｰﾄ）'!$AY36,COLUMN()-8,1)","v":""},{"$f":"MID('2主要取扱品目（業務）名表入力ｼｰﾄ（兼出力ｼｰﾄ）'!$AY36,COLUMN()-8,1)","v":""},{"$f":"MID('2主要取扱品目（業務）名表入力ｼｰﾄ（兼出力ｼｰﾄ）'!$AY36,COLUMN()-8,1)","v":""},{"$f":"MID('2主要取扱品目（業務）名表入力ｼｰﾄ（兼出力ｼｰﾄ）'!$AY36,COLUMN()-8,1)","v":""},{"$f":"MID('2主要取扱品目（業務）名表入力ｼｰﾄ（兼出力ｼｰﾄ）'!$AY36,COLUMN()-8,1)","v":""},{"$f":"MID('2主要取扱品目（業務）名表入力ｼｰﾄ（兼出力ｼｰﾄ）'!$AY36,COLUMN()-8,1)","v":""},{"$f":"MID('2主要取扱品目（業務）名表入力ｼｰﾄ（兼出力ｼｰﾄ）'!$AY36,COLUMN()-8,1)","v":""},{"$f":"MID('2主要取扱品目（業務）名表入力ｼｰﾄ（兼出力ｼｰﾄ）'!$AY36,COLUMN()-8,1)","v":""},{"$f":"MID('2主要取扱品目（業務）名表入力ｼｰﾄ（兼出力ｼｰﾄ）'!$AY36,COLUMN()-8,1)","v":""},{"$f":"MID('2主要取扱品目（業務）名表入力ｼｰﾄ（兼出力ｼｰﾄ）'!$AY36,COLUMN()-8,1)","v":""},{"$f":"MID('2主要取扱品目（業務）名表入力ｼｰﾄ（兼出力ｼｰﾄ）'!$AY36,COLUMN()-8,1)","v":""},{"$f":"MID('2主要取扱品目（業務）名表入力ｼｰﾄ（兼出力ｼｰﾄ）'!$AY36,COLUMN()-8,1)","v":""},{"$f":"MID('2主要取扱品目（業務）名表入力ｼｰﾄ（兼出力ｼｰﾄ）'!$AY36,COLUMN()-8,1)","v":""},{"$f":"MID('2主要取扱品目（業務）名表入力ｼｰﾄ（兼出力ｼｰﾄ）'!$AY36,COLUMN()-8,1)","v":""},{"$f":"MID('2主要取扱品目（業務）名表入力ｼｰﾄ（兼出力ｼｰﾄ）'!$AY36,COLUMN()-8,1)","v":""},{"$f":"MID('2主要取扱品目（業務）名表入力ｼｰﾄ（兼出力ｼｰﾄ）'!$AY36,COLUMN()-8,1)","v":""},{"$f":"MID('2主要取扱品目（業務）名表入力ｼｰﾄ（兼出力ｼｰﾄ）'!$AY36,COLUMN()-8,1)","v":""},{"$f":"MID('2主要取扱品目（業務）名表入力ｼｰﾄ（兼出力ｼｰﾄ）'!$AY36,COLUMN()-8,1)","v":""},{"$f":"MID('2主要取扱品目（業務）名表入力ｼｰﾄ（兼出力ｼｰﾄ）'!$AY36,COLUMN()-8,1)","v":""},{"$f":"MID('2主要取扱品目（業務）名表入力ｼｰﾄ（兼出力ｼｰﾄ）'!$AY36,COLUMN()-8,1)","v":""},{"$f":"MID('2主要取扱品目（業務）名表入力ｼｰﾄ（兼出力ｼｰﾄ）'!$AY36,COLUMN()-8,1)","v":""},{"$f":"MID('2主要取扱品目（業務）名表入力ｼｰﾄ（兼出力ｼｰﾄ）'!$AY36,COLUMN()-8,1)","v":""},{"$f":"MID('2主要取扱品目（業務）名表入力ｼｰﾄ（兼出力ｼｰﾄ）'!$AY36,COLUMN()-8,1)","v":""},{"$f":"MID('2主要取扱品目（業務）名表入力ｼｰﾄ（兼出力ｼｰﾄ）'!$AY36,COLUMN()-8,1)","v":""}]
[null,null,null,19,"大分類第2希望\n小分類第1希望"]
[null,null,null,null,null,null,null,null,{"$f":"MID('2主要取扱品目（業務）名表入力ｼｰﾄ（兼出力ｼｰﾄ）'!$AY38,COLUMN()-8,1)","v":""},{"$f":"MID('2主要取扱品目（業務）名表入力ｼｰﾄ（兼出力ｼｰﾄ）'!$AY38,COLUMN()-8,1)","v":""},{"$f":"MID('2主要取扱品目（業務）名表入力ｼｰﾄ（兼出力ｼｰﾄ）'!$AY38,COLUMN()-8,1)","v":""},{"$f":"MID('2主要取扱品目（業務）名表入力ｼｰﾄ（兼出力ｼｰﾄ）'!$AY38,COLUMN()-8,1)","v":""},{"$f":"MID('2主要取扱品目（業務）名表入力ｼｰﾄ（兼出力ｼｰﾄ）'!$AY38,COLUMN()-8,1)","v":""},{"$f":"MID('2主要取扱品目（業務）名表入力ｼｰﾄ（兼出力ｼｰﾄ）'!$AY38,COLUMN()-8,1)","v":""},{"$f":"MID('2主要取扱品目（業務）名表入力ｼｰﾄ（兼出力ｼｰﾄ）'!$AY38,COLUMN()-8,1)","v":""},{"$f":"MID('2主要取扱品目（業務）名表入力ｼｰﾄ（兼出力ｼｰﾄ）'!$AY38,COLUMN()-8,1)","v":""},{"$f":"MID('2主要取扱品目（業務）名表入力ｼｰﾄ（兼出力ｼｰﾄ）'!$AY38,COLUMN()-8,1)","v":""},{"$f":"MID('2主要取扱品目（業務）名表入力ｼｰﾄ（兼出力ｼｰﾄ）'!$AY38,COLUMN()-8,1)","v":""},{"$f":"MID('2主要取扱品目（業務）名表入力ｼｰﾄ（兼出力ｼｰﾄ）'!$AY38,COLUMN()-8,1)","v":""},{"$f":"MID('2主要取扱品目（業務）名表入力ｼｰﾄ（兼出力ｼｰﾄ）'!$AY38,COLUMN()-8,1)","v":""},{"$f":"MID('2主要取扱品目（業務）名表入力ｼｰﾄ（兼出力ｼｰﾄ）'!$AY38,COLUMN()-8,1)","v":""},{"$f":"MID('2主要取扱品目（業務）名表入力ｼｰﾄ（兼出力ｼｰﾄ）'!$AY38,COLUMN()-8,1)","v":""},{"$f":"MID('2主要取扱品目（業務）名表入力ｼｰﾄ（兼出力ｼｰﾄ）'!$AY38,COLUMN()-8,1)","v":""},{"$f":"MID('2主要取扱品目（業務）名表入力ｼｰﾄ（兼出力ｼｰﾄ）'!$AY38,COLUMN()-8,1)","v":""},{"$f":"MID('2主要取扱品目（業務）名表入力ｼｰﾄ（兼出力ｼｰﾄ）'!$AY38,COLUMN()-8,1)","v":""},{"$f":"MID('2主要取扱品目（業務）名表入力ｼｰﾄ（兼出力ｼｰﾄ）'!$AY38,COLUMN()-8,1)","v":""},{"$f":"MID('2主要取扱品目（業務）名表入力ｼｰﾄ（兼出力ｼｰﾄ）'!$AY38,COLUMN()-8,1)","v":""},{"$f":"MID('2主要取扱品目（業務）名表入力ｼｰﾄ（兼出力ｼｰﾄ）'!$AY38,COLUMN()-8,1)","v":""},{"$f":"MID('2主要取扱品目（業務）名表入力ｼｰﾄ（兼出力ｼｰﾄ）'!$AY38,COLUMN()-8,1)","v":""},{"$f":"MID('2主要取扱品目（業務）名表入力ｼｰﾄ（兼出力ｼｰﾄ）'!$AY38,COLUMN()-8,1)","v":""},{"$f":"MID('2主要取扱品目（業務）名表入力ｼｰﾄ（兼出力ｼｰﾄ）'!$AY38,COLUMN()-8,1)","v":""},{"$f":"MID('2主要取扱品目（業務）名表入力ｼｰﾄ（兼出力ｼｰﾄ）'!$AY38,COLUMN()-8,1)","v":""},{"$f":"MID('2主要取扱品目（業務）名表入力ｼｰﾄ（兼出力ｼｰﾄ）'!$AY38,COLUMN()-8,1)","v":""},{"$f":"MID('2主要取扱品目（業務）名表入力ｼｰﾄ（兼出力ｼｰﾄ）'!$AY38,COLUMN()-8,1)","v":""},{"$f":"MID('2主要取扱品目（業務）名表入力ｼｰﾄ（兼出力ｼｰﾄ）'!$AY38,COLUMN()-8,1)","v":""},{"$f":"MID('2主要取扱品目（業務）名表入力ｼｰﾄ（兼出力ｼｰﾄ）'!$AY38,COLUMN()-8,1)","v":""},{"$f":"MID('2主要取扱品目（業務）名表入力ｼｰﾄ（兼出力ｼｰﾄ）'!$AY38,COLUMN()-8,1)","v":""},{"$f":"MID('2主要取扱品目（業務）名表入力ｼｰﾄ（兼出力ｼｰﾄ）'!$AY38,COLUMN()-8,1)","v":""},{"$f":"MID('2主要取扱品目（業務）名表入力ｼｰﾄ（兼出力ｼｰﾄ）'!$AY38,COLUMN()-8,1)","v":""},{"$f":"MID('2主要取扱品目（業務）名表入力ｼｰﾄ（兼出力ｼｰﾄ）'!$AY38,COLUMN()-8,1)","v":""},{"$f":"MID('2主要取扱品目（業務）名表入力ｼｰﾄ（兼出力ｼｰﾄ）'!$AY38,COLUMN()-8,1)","v":""},{"$f":"MID('2主要取扱品目（業務）名表入力ｼｰﾄ（兼出力ｼｰﾄ）'!$AY38,COLUMN()-8,1)","v":""},{"$f":"MID('2主要取扱品目（業務）名表入力ｼｰﾄ（兼出力ｼｰﾄ）'!$AY38,COLUMN()-8,1)","v":""},{"$f":"MID('2主要取扱品目（業務）名表入力ｼｰﾄ（兼出力ｼｰﾄ）'!$AY38,COLUMN()-8,1)","v":""},{"$f":"MID('2主要取扱品目（業務）名表入力ｼｰﾄ（兼出力ｼｰﾄ）'!$AY38,COLUMN()-8,1)","v":""},{"$f":"MID('2主要取扱品目（業務）名表入力ｼｰﾄ（兼出力ｼｰﾄ）'!$AY38,COLUMN()-8,1)","v":""},{"$f":"MID('2主要取扱品目（業務）名表入力ｼｰﾄ（兼出力ｼｰﾄ）'!$AY38,COLUMN()-8,1)","v":""},{"$f":"MID('2主要取扱品目（業務）名表入力ｼｰﾄ（兼出力ｼｰﾄ）'!$AY38,COLUMN()-8,1)","v":""},{"$f":"MID('2主要取扱品目（業務）名表入力ｼｰﾄ（兼出力ｼｰﾄ）'!$AY38,COLUMN()-8,1)","v":""},{"$f":"MID('2主要取扱品目（業務）名表入力ｼｰﾄ（兼出力ｼｰﾄ）'!$AY38,COLUMN()-8,1)","v":""},{"$f":"MID('2主要取扱品目（業務）名表入力ｼｰﾄ（兼出力ｼｰﾄ）'!$AY38,COLUMN()-8,1)","v":""},{"$f":"MID('2主要取扱品目（業務）名表入力ｼｰﾄ（兼出力ｼｰﾄ）'!$AY38,COLUMN()-8,1)","v":""},{"$f":"MID('2主要取扱品目（業務）名表入力ｼｰﾄ（兼出力ｼｰﾄ）'!$AY38,COLUMN()-8,1)","v":""},{"$f":"MID('2主要取扱品目（業務）名表入力ｼｰﾄ（兼出力ｼｰﾄ）'!$AY38,COLUMN()-8,1)","v":""},{"$f":"MID('2主要取扱品目（業務）名表入力ｼｰﾄ（兼出力ｼｰﾄ）'!$AY38,COLUMN()-8,1)","v":""},{"$f":"MID('2主要取扱品目（業務）名表入力ｼｰﾄ（兼出力ｼｰﾄ）'!$AY38,COLUMN()-8,1)","v":""},{"$f":"MID('2主要取扱品目（業務）名表入力ｼｰﾄ（兼出力ｼｰﾄ）'!$AY38,COLUMN()-8,1)","v":""},{"$f":"MID('2主要取扱品目（業務）名表入力ｼｰﾄ（兼出力ｼｰﾄ）'!$AY38,COLUMN()-8,1)","v":""}]
[]
[null,null,"都道府県コード　一　覧　表"]
[null,null,"区分",null,null,null,"許可元名称",null,null,null,null,"区分",null,null,null,"許可元名称"]
[]
[null,null,null,null,null,null,null,null,null,null,null,null,"24",null,null,"三重県"]
[null,null,null,"01",null,null,"北海道",null,null,null,null,null,"25",null,null,"滋賀県"]
[null,null,null,"02",null,null,"青森県",null,null,null,null,null,"26",null,null,"京都府"]
[null,null,null,"03",null,null,"岩手県",null,null,null,null,null,"27",null,null,"大阪府"]
[null,null,null,"04",null,null,"宮城県",null,null,null,null,null,"28",null,null,"兵庫県"]
[null,null,null,"05",null,null,"秋田県",null,null,null,null,null,"29",null,null,"奈良県"]
[null,null,null,"06",null,null,"山形県",null,null,null,null,null,"30",null,null,"和歌山県"]
[null,null,null,"07",null,null,"福島県",null,null,null,null,null,"31",null,null,"鳥取県"]
[null,null,null,"08",null,null,"茨城県",null,null,null,null,null,"32",null,null,"島根県"]
[null,null,null,"09",null,null,"栃木県",null,null,null,null,null,"33",null,null,"岡山県"]
[null,null,null,"10",null,null,"群馬県",null,null,null,null,null,"34",null,null,"広島県"]
[null,null,null,"11",null,null,"埼玉県",null,null,null,null,null,"35",null,null,"山口県"]
[null,null,null,"12",null,null,"千葉県",null,null,null,null,null,"36",null,null,"徳島県"]
[null,null,null,"13",null,null,"東京都",null,null,null,null,null,"37",null,null,"香川県"]
[null,null,null,"14",null,null,"神奈川県",null,null,null,null,null,"38",null,null,"愛媛県"]
[null,null,null,"15",null,null,"新潟県",null,null,null,null,null,"39",null,null,"高知県"]
[null,null,null,"16",null,null,"富山県",null,null,null,null,null,"40",null,null,"福岡県"]
[null,null,null,"17",null,null,"石川県",null,null,null,null,null,"41",null,null,"佐賀県"]
[null,null,null,"18",null,null,"福井県",null,null,null,null,null,"42",null,null,"長崎県"]
[null,null,null,"19",null,null,"山梨県",null,null,null,null,null,"43",null,null,"熊本県"]
[null,null,null,"20",null,null,"長野県",null,null,null,null,null,"44",null,null,"大分県"]
[null,null,null,"21",null,null,"岐阜県",null,null,null,null,null,"45",null,null,"宮崎県"]
[null,null,null,"22",null,null,"静岡県",null,null,null,null,null,"46",null,null,"鹿児島県"]
[null,null,null,"23",null,null,"愛知県",null,null,null,null,null,47,null,null,"沖縄県",null,null,null,null,null,null,null,null,null,null,null,null,null,null,null,null,null,null,null,null,null,null,null,null,null,null,null,null,null,null,null,null,null,null,null,null,null,null,null,null,null,null,{"$f":"'1入力ｼｰﾄ'!N316","v":""},null,null,null,{"$f":"'1入力ｼｰﾄ'!U316","v":""}]

{"sheet":"リストシート","index":8,"n_rows":111,"n_cols":15,"rows_kept":111,"cut":false,"hidden":true,"merged":[[0,9,0,10]]}
["法個リスト","元号リスト","年リスト","月リスト","日リスト","性別リスト","都道府県リスト","履行場所リスト","大分類リスト","小分類リスト",null,null,null,null,"西暦リスト"]
["法人","明治","01","01","01","男性","01 北海道","北海道","101 医療・衛生",{"$f":"LEFT(I$2,3)&LEFT(K2,3)","v":"101001"},"001　医薬品・衛生材料"," 医薬品・衛生材料",101,"001","2012"]
["個人","大正","02","02","02","女性","02 青森県","青森県","102 衣料・繊維",{"$f":"LEFT(I$2,3)&LEFT(K3,3)","v":"101002"},"002　医療機械器具"," 医療機械器具",102,"002","2013"]
[null,"昭和","03","03","03",null,"03 岩手県","岩手県","103 印刷・製本","101003","003　ﾚﾝﾄｹﾞﾝ機械器具"," ﾚﾝﾄｹﾞﾝ機械器具",103,"003","2014"]
[null,"平成","04","04","04",null,"04 宮城県","宮城県","104 機械・器具","101004","004　歯科用医療器材・薬品"," 歯科用医療器材・薬品",104,"004","2015"]
[null,null,"05","05","05",null,"05 秋田県","秋田県","105 電気機械・器具","101005","005　歯科技工"," 歯科技工",105,"005","2016"]
["申請区分リスト",null,"06","06","06",null,"06 山形県","山形県","106 精密機械","101006","006　防疫剤・農業薬品"," 防疫剤・農業薬品",106,"006","2017"]
["新規",null,"07","07","07",null,"07 福島県","福島県","107 資　材","101007","007　動物用医療器材・薬品"," 動物用医療器材・薬品",107,"007","2018"]
["継続",null,"08","08","08",null,"08 茨城県","茨城県","108 事務機器・用品","101008","008　工業薬品"," 工業薬品",108,"008","2019"]
[null,null,"09","09","09",null,"09 栃木県","栃木県","109 消防・標識","101009","009　試薬"," 試薬",109,"009","2020"]
["行政区リスト",null,"10","10","10",null,"10 群馬県","群馬県","110 日用品・ギフト用品",{"$f":"LEFT(I$3,3)&LEFT(K11,3)","v":"102001"},"001　寝具"," 寝具",110,"010","2021"]
["11 青葉区",null,"11","11","11",null,"11 埼玉県","埼玉県","111 燃　料","102002","002　帆布"," 帆布",111,"011","2022"]
["12 宮城総合支所",null,"12","12","12",null,"12 千葉県","千葉県","112 農林水産","102003","003　染色"," 染色",112,"012","2023"]
["21 宮城野区",null,"13",null,"13",null,"13 東京都","東京都","113 輸送機器","102004","004　被服・縫製"," 被服・縫製",113,"013","2024"]
["31 若林区",null,"14",null,"14",null,"14 神奈川県","神奈川県","114 その他物品販売","102005","005　皮革・ゴム製品"," 皮革・ゴム製品",114,null,"2025"]
["41 太白区",null,"15",null,"15",null,"15 新潟県","新潟県","115 不用品買受","102006","006　室内装飾"," 室内装飾",115,null,"2026"]
["42 秋保総合支所",null,"16",null,"16",null,"16 富山県","富山県","116 サービス",{"$f":"LEFT(I$4,3)&LEFT(K17,3)","v":"103001"},"001　一般印刷"," 一般印刷",116,null,"2027"]
["51 泉区",null,"17",null,"17",null,"17 石川県","石川県","117 清掃等","103002","002　フォーム印刷"," フォーム印刷",117,null,"2028"]
[null,null,"18",null,"18",null,"18 福井県","福井県","118 警　備","103003","003　特殊印刷"," 特殊印刷",118,null,"2029"]
[null,null,"19",null,"19",null,"19 山梨県","山梨県",null,"103004","004　地図・航空写真"," 地図・航空写真",null,null,"2030"]
[null,null,"20",null,"20",null,"20 長野県","長野県",null,"103005","005　製本"," 製本",null,null,"2031"]
["元・下リスト",null,"21",null,"21",null,"21 岐阜県","岐阜県",null,"103006","006　複写・青写真焼付け"," 複写・青写真焼付け",null,null,"2032"]
["元請",null,"22",null,"22",null,"22 静岡県","静岡県",null,{"$f":"LEFT(I$5,3)&LEFT(K23,3)","v":"104001"},"001　土木建築用機械器具"," 土木建築用機械器具"]
["下請",null,"23",null,"23",null,"23 愛知県","愛知県",null,{"$f":"LEFT(I$5,3)&LEFT(K24,3)","v":"104002"},"002　農業用機械器具"," 農業用機械器具"]
[null,null,"24",null,"24",null,"24 三重県","三重県",null,"104003","003　ﾎﾞｲﾗｰ・空調機器"," ﾎﾞｲﾗｰ・空調機器"]
[null,null,"25",null,"25",null,"25 滋賀県","滋賀県",null,"104004","004　厨房用機械器具"," 厨房用機械器具"]
["清掃警備大分類",null,"26",null,"26",null,"26 京都府","京都府",null,"104005","005　産業用機械器具"," 産業用機械器具"]
["清　掃",null,"27",null,"27",null,"27 大阪府","大阪府",null,"104006","006　工作用機械器具"," 工作用機械器具"]
["警　備",null,"28",null,"28",null,"28 兵庫県","兵庫県",null,"104007","007　工具・部品"," 工具・部品"]
[null,null,"29",null,"29",null,"29 奈良県","奈良県",null,"104008","008　各種ﾌﾟﾗﾝﾄ・ｼｽﾃﾑ"," 各種ﾌﾟﾗﾝﾄ・ｼｽﾃﾑ"]
[null,null,"30",null,"30",null,"30 和歌山県","和歌山県",null,"104009","009　ガス・石油機器"," ガス・石油機器"]
["ビルメンテ",null,"31",null,"31",null,"31 鳥取県","鳥取県",null,{"$f":"LEFT(I$6,3)&LEFT(K32,3)","v":"105001"},"001　家電製品"," 家電製品"]
["その他清掃",null,"32",null,null,null,"32 島根県","島根県",null,{"$f":"LEFT(I$6,3)&LEFT(K33,3)","v":"105002"},"002　視聴覚機器"," 視聴覚機器"]
["廃棄物処理",null,"33",null,null,null,"33 岡山県","岡山県",null,"105003","003　通信機器"," 通信機器"]
["警　備",null,"34",null,null,null,"34 広島県","広島県",null,"105004","004　照明機器"," 照明機器"]
[null,null,"35",null,null,null,"35 山口県","山口県",null,"105005","005　情報処理用機器"," 情報処理用機器"]
[null,null,"36",null,null,null,"36 徳島県","徳島県",null,"105006","006　情報処理用品"," 情報処理用品"]
[null,null,"37",null,null,null,"37 香川県","香川県",null,"105007","007　産業用電気機械・部品"," 産業用電気機械・部品"]
[null,null,"38",null,null,null,"38 愛媛県","愛媛県",null,"105008","008　バッテリー"," バッテリー"]
[null,null,"39",null,null,null,"39 高知県","高知県",null,{"$f":"LEFT(I$7,3)&LEFT(K40,3)","v":"106001"},"001　写真機"," 写真機"]
[null,null,"40",null,null,null,"40 福岡県","福岡県",null,{"$f":"LEFT(I$7,3)&LEFT(K41,3)","v":"106002"},"002　Ｄ・Ｐ・E"," Ｄ・Ｐ・E"]
[null,null,"41",null,null,null,"41 佐賀県","佐賀県",null,"106003","003　楽器"," 楽器"]
[null,null,"42",null,null,null,"42 長崎県","長崎県",null,"106004","004　時計"," 時計"]
[null,null,"43",null,null,null,"43 熊本県","熊本県",null,"106005","005　ミシン"," ミシン"]
[null,null,"44",null,null,null,"44 大分県","大分県",null,"106006","006　試験実験機器"," 試験実験機器"]
[null,null,"45",null,null,null,"45 宮崎県","宮崎県",null,"106007","007　計測量機器"," 計測量機器"]
[null,null,"46",null,null,null,"46 鹿児島県","鹿児島県",null,"106008","008　公害関係機器"," 公害関係機器"]
[null,null,"47",null,null,null,"47 沖縄県","沖縄県",null,{"$f":"LEFT(I$8,3)&LEFT(K48,3)","v":"107001"},"001　ｺﾝｸﾘｰﾄ二次製品"," ｺﾝｸﾘｰﾄ二次製品"]
[null,null,"48",null,null,null,null,null,null,{"$f":"LEFT(I$8,3)&LEFT(K49,3)","v":"107002"},"002　ヒューム管"," ヒューム管"]
[null,null,"49",null,null,null,null,null,null,"107003","003　骨材・石材"," 骨材・石材"]
[null,null,"50",null,null,null,null,null,null,"107004","004　道路材"," 道路材"]
[null,null,"51",null,null,null,null,null,null,"107005","005　建材・木材"," 建材・木材"]
[null,null,"52",null,null,null,null,null,null,"107006","006　給排水資材"," 給排水資材"]
[null,null,"53",null,null,null,null,null,null,"107007","007　電設資材"," 電設資材"]
[null,null,"54",null,null,null,null,null,null,"107008","008　ガス供給資材"," ガス供給資材"]
[null,null,"55",null,null,null,null,null,null,"107009","009　鋼材"," 鋼材"]
[null,null,"56",null,null,null,null,null,null,"107010","010　鉄工加工品"," 鉄工加工品"]
[null,null,"57",null,null,null,null,null,null,"107011","011　鋳鉄・鉄蓋"," 鋳鉄・鉄蓋"]
[null,null,"58",null,null,null,null,null,null,"107012","012　塩ビ・ｺﾞﾑ・ﾌﾟﾗｽﾁｯｸ製品"," 塩ビ・ｺﾞﾑ・ﾌﾟﾗｽﾁｯｸ製品"]
[null,null,"59",null,null,null,null,null,null,"107013","013　塗料・接着剤"," 塗料・接着剤"]
[null,null,"60",null,null,null,null,null,null,{"$f":"LEFT(I$9,3)&LEFT(K61,3)","v":"108001"},"001　紙"," 紙"]
[null,null,"61",null,null,null,null,null,null,{"$f":"LEFT(I$9,3)&LEFT(K62,3)","v":"108002"},"002　木鋼製品"," 木鋼製品"]
[null,null,"62",null,null,null,null,null,null,"108003","003　文具"," 文具"]
[null,null,"63",null,null,null,null,null,null,"108004","004　事務機"," 事務機"]
[null,null,"64",null,null,null,null,null,null,"108005","005　特殊事務機"," 特殊事務機"]
[null,null,null,null,null,null,null,null,null,"108006","006　図書"," 図書"]
[null,null,null,null,null,null,null,null,null,"108007","007　学校等教材教具"," 学校等教材教具"]
[null,null,null,null,null,null,null,null,null,"108008","008　運動用具"," 運動用具"]
[null,null,null,null,null,null,null,null,null,"108009","009　印"," 印"]
[null,null,null,null,null,null,null,null,null,"108010","010　遊具"," 遊具"]
[null,null,null,null,null,null,null,null,null,{"$f":"LEFT(I$10,3)&LEFT(K71,3)","v":"109001"},"001　消防・保安"," 消防・保安"]
[null,null,null,null,null,null,null,null,null,{"$f":"LEFT(I$10,3)&LEFT(K72,3)","v":"109002"},"002　標識"," 標識"]
[null,null,null,null,null,null,null,null,null,{"$f":"LEFT(I$10,3)&LEFT(K73,3)","v":"109003"},"003　看板・標示板"," 看板・標示板"]
[null,null,null,null,null,null,null,null,null,{"$f":"LEFT(I$11,3)&LEFT(K74,3)","v":"110001"},"001　金物・雑貨"," 金物・雑貨"]
[null,null,null,null,null,null,null,null,null,"110002","002　清掃器材"," 清掃器材"]
[null,null,null,null,null,null,null,null,null,"110003","003　陶磁器・漆器"," 陶磁器・漆器"]
[null,null,null,null,null,null,null,null,null,"110004","004　記章・カップ"," 記章・カップ"]
[null,null,null,null,null,null,null,null,null,"110005","005　ギフト用品"," ギフト用品"]
[null,null,null,null,null,null,null,null,null,"110006","006　美術・工芸品"," 美術・工芸品"]
[null,null,null,null,null,null,null,null,null,{"$f":"LEFT(I$12,3)&LEFT(K80,3)","v":"111001"},"001　石油燃料"," 石油燃料"]
[null,null,null,null,null,null,null,null,null,{"$f":"LEFT(I$12,3)&LEFT(K81,3)","v":"111002"},"002　石炭・プロパン"," 石炭・プロパン"]
[null,null,null,null,null,null,null,null,null,{"$f":"LEFT(I$12,3)&LEFT(K82,3)","v":"111003"},"003　潤滑油"," 潤滑油"]
[null,null,null,null,null,null,null,null,null,{"$f":"LEFT(I$13,3)&LEFT(K83,3)","v":"112001"},"001　食料品"," 食料品"]
[null,null,null,null,null,null,null,null,null,{"$f":"LEFT(I$13,3)&LEFT(K84,3)","v":"112002"},"002　農園芸材料"," 農園芸材料"]
[null,null,null,null,null,null,null,null,null,{"$f":"LEFT(I$13,3)&LEFT(K85,3)","v":"112003"},"003　動物"," 動物"]
[null,null,null,null,null,null,null,null,null,{"$f":"LEFT(I$14,3)&LEFT(K86,3)","v":"113001"},"001　自動車"," 自動車"]
[null,null,null,null,null,null,null,null,null,{"$f":"LEFT(I$14,3)&LEFT(K87,3)","v":"113002"},"002　大型・特殊車"," 大型・特殊車"]
[null,null,null,null,null,null,null,null,null,"113003","003　地下鉄"," 地下鉄"]
[null,null,null,null,null,null,null,null,null,"113004","004　自動車部品"," 自動車部品"]
[null,null,null,null,null,null,null,null,null,"113005","005　自動車修理"," 自動車修理"]
[null,null,null,null,null,null,null,null,null,"113006","006　二輪車"," 二輪車"]
[null,null,null,null,null,null,null,null,null,"113007","007　タイヤ"," タイヤ"]
[null,null,null,null,null,null,null,null,null,"113008","008　船舶・航空機"," 船舶・航空機"]
[null,null,null,null,null,null,null,null,null,{"$f":"LEFT(I15,3)&LEFT(K94,3)","v":"114001"},"001　その他物品販売"," その他物品販売"]
[null,null,null,null,null,null,null,null,null,{"$f":"LEFT(I$16,3)&LEFT(K95,3)","v":"115001"},"001　不用品買受"," 不用品買受"]
[null,null,null,null,null,null,null,null,null,{"$f":"LEFT(I$17,3)&LEFT(K96,3)","v":"116001"},"001　情報処理"," 情報処理"]
[null,null,null,null,null,null,null,null,null,{"$f":"LEFT(I$17,3)&LEFT(K97,3)","v":"116002"},"002　ＯＡ機器賃貸"," ＯＡ機器賃貸"]
[null,null,null,null,null,null,null,null,null,"116003","003　その他賃貸"," その他賃貸"]
[null,null,null,null,null,null,null,null,null,"116004","004　運送"," 運送"]
[null,null,null,null,null,null,null,null,null,"116005","005　害虫駆除"," 害虫駆除"]
[null,null,null,null,null,null,null,null,null,"116006","006　クリーニング"," クリーニング"]
[null,null,null,null,null,null,null,null,null,"116007","007　広告宣伝"," 広告宣伝"]
[null,null,null,null,null,null,null,null,null,"116008","008　各種検査"," 各種検査"]
[null,null,null,null,null,null,null,null,null,"116009","009　各種調査"," 各種調査"]
[null,null,null,null,null,null,null,null,null,"116010","010　機械保守点検"," 機械保守点検"]
[null,null,null,null,null,null,null,null,null,"116011","011　その他サービス"," その他サービス"]
[null,null,null,null,null,null,null,null,null,{"$f":"LEFT(I$18,3)&LEFT(K107,3)","v":"117001"},"001　ビルメンテナンス"," ビルメンテナンス"]
[null,null,null,null,null,null,null,null,null,{"$f":"LEFT(I$18,3)&LEFT(K108,3)","v":"117002"},"002　その他清掃"," その他清掃"]
[null,null,null,null,null,null,null,null,null,{"$f":"LEFT(I$18,3)&LEFT(K109,3)","v":"117003"},"003　廃棄物処理"," 廃棄物処理"]
[null,null,null,null,null,null,null,null,null,{"$f":"LEFT(I19,3)&LEFT(K110,3)","v":"118001"},"001　警備"," 警備"]
[null,null,null,null,null,null,null,null,null,null,null,"←小分類コードを入力してください"]